program: Orca
programVersion: 5.0.3
elementType: C C C N N N N H H N H H N H H H
charge: 1
multiplicity: 1
keywords: wB97X-D3 TightOpt Freq def2-TZVPP def2/J RIJCOSX TightSCF defgrid3 CHELPG
frequency: 0.00 0.00 0.00 0.00 0.00 0.00 58.62 180.76 196.33 207.51 305.61 345.22 426.28 430.69 528.36 562.32 579.96 606.40 608.31 640.69 668.86 773.00 841.46 972.48 978.76 1015.71 1078.95 1093.63 1114.95 1196.32 1358.59 1412.78 1486.52 1540.76 1560.54 1579.72 1639.13 1641.25 1667.41 1716.09 1763.30 3440.30 3532.75 3540.04 3645.82 3649.12 3778.11 3778.63
frequency: 58.62 180.76 196.33 207.51 305.61 345.22 426.28 430.69 528.36 562.32 579.96 606.40 608.31 640.69 668.86 773.00 841.46 972.48 978.76 1015.71 1078.95 1093.63 1114.95 1196.32 1358.59 1412.78 1486.52 1540.76 1560.54 1579.72 1639.13 1641.25 1667.41 1716.09 1763.30 3440.30 3532.75 3540.04 3645.82 3649.12 3778.11 3778.63
formula: C3H7N6
InChI: InChI=1S/C3H7N6/c4-1-7-2(5)9-3(6)8-1/h4-5H2,6H3
16 atoms
C  0.711703 -1.129593 -0.000016
C  0.706469 1.132519 -0.000032
C  -1.17354 -0.00436 0.000015
N  -0.660601 1.184733 0.000042
N  1.405884 0.003939 -0.000054
N  -0.653116 -1.189933 0.0000
N  -2.66578 -0.004323 -0.00007
H  -3.016244 -0.492107 -0.825438
H  -3.016303 -0.496718 0.822525
N  1.352195 2.290624 -0.000038
H  2.356001 2.296821 -0.000067
H  0.841873 3.15403 -0.00002
N  1.366362 -2.282648 0.000003
H  0.862241 -3.149715 -0.000052
H  2.370135 -2.28131 -0.000061
H  -2.996961 0.961412 0.00245
totalener: -446.90580867 hartree
nucrepener: 456.16392693 hartree
electener: -903.06973559 hartree
oneelecener: -1498.86535627 hartree
twoeener: 595.79562067 hartree
kineticenergy: 444.74557973 hartree
xcener: -41.731892545612 hartree
chargesum: 1.0000000
charge: 0.386038 0.388681 0.248373 -0.382351 -0.352488 -0.384222 0.119238 0.210099 0.210122 -0.213057 0.196993 0.187869 -0.212052 0.188177 0.196415 0.212166
charge: -0.325577 -0.325356 -0.341155 0.114564 0.135977 0.115544 0.621125 0.067543 0.067531 0.409966 -0.001019 -0.006493 0.409758 -0.006398 -0.001266 0.065258
qa: 0.3860 0.3887 0.2484 -0.3824 -0.3525 -0.3842 0.1192 0.2101 0.2101 -0.2131 0.1970 0.1879 -0.2121 0.1882 0.1964 0.2122
va: 4.2631 4.2598 4.2879 2.9865 3.0201 3.0212 3.6775 0.9919 0.9920 3.3165 1.0098 1.0146 3.3143 1.0143 1.0104 1.0024
dispcorr: -0.003755964 hartree
energy: -446.910851394873
dipole: -2.55969 0.22726 -2.33243 -0.00755 -0.00009 -0.00764 -0.00048 0.00013 -0.00035
magnitude: 2.33244 au
magnitude: 5.92859 debye
temp: 298.15 k
press: 1.00 atm
zeropoint: 0.13245734 hartree
thermalvibcorrection: 0.00540992 hartree
thermalrotcorrection: 0.00141627 hartree
thermaltrasncorrection: 0.00141627 hartree
thermaltotal: -446.77015160 hartree
thermalcorr: 0.00824246 hartree
nonthermalcorr: 0.13245734 hartree
totalcorr: 0.14069979 hartree
thermalcorrenthalpy: 0.00094421 hartree
totalenthalpy: -446.76920739 hartree
totalentropycorr: -0.04174011 hartree
gibbsenthalpy: -446.81094751 hartree
gibbsminuselec: 0.09990389 hartree
