program: Orca
programVersion: 5.0.3
elementType: C N C O O C C C C C C C C C H H H H H H H H H H H H H H H H
charge: 1
multiplicity: 1
keywords: wB97X-D3 TightOpt Freq def2-TZVPP def2/J RIJCOSX TightSCF defgrid3 CHELPG
frequency: 0.00 0.00 0.00 0.00 0.00 0.00 27.60 37.42 41.76 57.35 87.79 122.63 183.60 210.09 216.80 227.89 253.40 265.31 284.49 359.65 413.64 466.94 499.93 519.00 529.23 558.59 578.69 588.35 629.92 675.57 749.07 773.14 781.40 798.63 851.96 915.43 918.02 940.54 963.79 979.93 1009.93 1053.92 1063.74 1094.60 1097.36 1143.05 1145.91 1161.00 1183.55 1188.67 1200.16 1215.23 1242.93 1256.57 1313.65 1329.19 1347.52 1391.61 1418.00 1420.42 1440.02 1472.59 1487.80 1495.78 1497.32 1502.05 1510.04 1511.62 1513.57 1541.55 1606.39 1659.39 1694.49 1765.59 3060.70 3065.60 3067.50 3095.84 3134.57 3144.34 3148.86 3150.88 3179.43 3207.81 3211.96 3219.27 3227.47 3239.77 3657.02 3696.26
frequency: 27.60 37.42 41.76 57.35 87.79 122.63 183.60 210.09 216.80 227.89 253.40 265.31 284.49 359.65 413.64 466.94 499.93 519.00 529.23 558.59 578.69 588.35 629.92 675.57 749.07 773.14 781.40 798.63 851.96 915.43 918.02 940.54 963.79 979.93 1009.93 1053.92 1063.74 1094.60 1097.36 1143.05 1145.91 1161.00 1183.55 1188.67 1200.16 1215.23 1242.93 1256.57 1313.65 1329.19 1347.52 1391.61 1418.00 1420.42 1440.02 1472.59 1487.80 1495.78 1497.32 1502.05 1510.04 1511.62 1513.57 1541.55 1606.39 1659.39 1694.49 1765.59 3060.70 3065.60 3067.50 3095.84 3134.57 3144.34 3148.86 3150.88 3179.43 3207.81 3211.96 3219.27 3227.47 3239.77 3657.02 3696.26
formula: C11H16NO2
InChI: InChI=1S/C11H16NO2/c1-8(2)9-6-4-5-7-10(9)14-11(13)12-3/h4-8,12-13H,1-3H3
30 atoms
C  3.714072 -0.122946 -1.085103
N  3.144804 0.077104 0.246889
C  1.893437 0.365728 0.461507
O  1.495021 0.515028 1.686489
O  1.106744 0.490946 -0.557178
C  -0.273014 0.782195 -0.314451
C  -0.635239 2.117411 -0.361514
C  -1.963738 2.442137 -0.161613
C  -2.884163 1.428982 0.074011
C  -2.482956 0.105702 0.105033
C  -1.152209 -0.267928 -0.094835
C  -0.733917 -1.724905 -0.091303
C  -1.048785 -2.396518 1.246963
C  -1.381703 -2.471484 -1.260373
H  4.775135 -0.316335 -0.966606
H  3.576306 0.768726 -1.692261
H  3.244385 -0.97426 -1.573034
H  3.730065 -0.009058 1.062494
H  0.11009 2.875503 -0.564055
H  -2.27797 3.476086 -0.195857
H  -3.92629 1.674213 0.229304
H  -3.221137 -0.666342 0.280506
H  0.347511 -1.77284 -0.241815
H  -2.122051 -2.417148 1.438699
H  -0.571597 -1.883961 2.084266
H  -0.696316 -3.427659 1.242015
H  -2.467789 -2.490545 -1.161564
H  -1.03336 -3.50382 -1.286625
H  -1.139676 -2.00462 -2.215134
H  0.54836 0.730516 1.722931
totalener: -633.84774678 hartree
nucrepener: 927.63095547 hartree
electener: -1561.47870225 hartree
oneelecener: -2684.32744620 hartree
twoeener: 1122.84874394 hartree
kineticenergy: 630.56029137 hartree
xcener: -61.543670392936 hartree
chargesum: 1.0000000
charge: -0.128004 -0.148631 0.530265 -0.208655 -0.228251 0.053345 -0.101005 -0.098841 -0.112291 -0.113590 -0.021811 -0.029940 -0.216072 -0.238282 0.125127 0.131831 0.131917 0.196283 0.149124 0.157571 0.154956 0.136931 0.032034 0.095534 0.077013 0.108715 0.094222 0.103909 0.103432 0.263163
charge: 0.043091 0.376931 -0.404690 0.458100 0.395129 -0.161112 -0.002947 0.016351 0.024284 0.030766 -0.059999 -0.096261 0.026531 0.033595 0.029448 0.026156 0.024982 0.018387 0.034877 0.035125 0.036540 0.035862 0.023296 0.020709 0.010046 0.024103 0.020738 0.022484 0.019456 -0.061979
qa: -0.1280 -0.1486 0.5303 -0.2087 -0.2283 0.0533 -0.1010 -0.0988 -0.1123 -0.1136 -0.0218 -0.0299 -0.2161 -0.2383 0.1251 0.1318 0.1319 0.1963 0.1491 0.1576 0.1550 0.1369 0.0320 0.0955 0.0770 0.1087 0.0942 0.1039 0.1034 0.2632
va: 3.8469 3.3775 4.2083 2.3103 2.2332 3.7273 4.0347 3.9617 4.0134 3.9882 3.6823 3.9280 3.8972 3.9285 0.9971 0.9939 0.9926 1.0024 1.0013 0.9943 0.9957 1.0044 1.0212 1.0096 1.0112 1.0078 1.0078 1.0063 1.0035 1.0141
dispcorr: -0.012906618 hartree
energy: -633.862353094761
dipole: -1.08319 3.11407 2.03088 -10.10606 10.40614 0.30008 -1.85059 2.12733 0.27673
magnitude: 2.07150 au
magnitude: 5.26533 debye
temp: 298.15 k
press: 1.00 atm
zeropoint: 0.25968839 hartree
thermalvibcorrection: 0.01181420 hartree
thermalrotcorrection: 0.00141627 hartree
thermaltrasncorrection: 0.00141627 hartree
thermaltotal: -633.58801796 hartree
thermalcorr: 0.01464674 hartree
nonthermalcorr: 0.25968839 hartree
totalcorr: 0.27433513 hartree
thermalcorrenthalpy: 0.00094421 hartree
totalenthalpy: -633.58707375 hartree
totalentropycorr: -0.05585097 hartree
gibbsenthalpy: -633.64292472 hartree
gibbsminuselec: 0.21942838 hartree
