program: Orca
programVersion: 5.0.3
elementType: N H C H H C H H O O H
charge: 1
multiplicity: 1
keywords: wB97X-D3 TightOpt Freq def2-TZVPP def2/J RIJCOSX TightSCF defgrid3 CHELPG
frequency: 0.00 0.00 0.00 0.00 0.00 0.00 17.09 161.83 268.71 492.58 533.55 589.04 675.62 830.38 893.06 990.92 1089.22 1114.43 1201.83 1344.63 1361.68 1416.17 1480.56 1543.35 1655.24 1667.54 1927.55 3126.90 3188.12 3450.55 3525.21 3536.94 3793.27
frequency: 17.09 161.83 268.71 492.58 533.55 589.04 675.62 830.38 893.06 990.92 1089.22 1114.43 1201.83 1344.63 1361.68 1416.17 1480.56 1543.35 1655.24 1667.54 1927.55 3126.90 3188.12 3450.55 3525.21 3536.94 3793.27
formula: C2H6NO2
InChI: InChI=1S/C2H6NO2/c3-1-2(4)5/h4H,1H2,3H3
11 atoms
N  -1.794746 0.114356 -0.00018
H  -1.77585 0.724874 -0.818263
C  -0.62165 -0.820153 0.000251
H  -1.775392 0.726132 0.816955
H  -2.677824 -0.396391 0.00044
C  0.706795 -0.077886 -0.000093
H  -0.680774 -1.450609 0.88535
H  -0.680772 -1.451493 -0.884212
O  1.745101 -0.647141 -0.000117
O  0.516684 1.248853 0.000088
H  1.372183 1.699554 0.000085
totalener: -284.82438245 hartree
nucrepener: 188.90982686 hartree
electener: -473.73420931 hartree
oneelecener: -753.42029185 hartree
twoeener: 279.68608254 hartree
kineticenergy: 283.52021000 hartree
xcener: -25.633360801464 hartree
energy: -529.8367 -527.9801 -401.9112 -288.5621 -287.2274 -38.6789 -36.5980 -36.1852 -29.4579 -25.8286 -24.8431 -24.3303 -22.8462 -21.0254 -21.0214 -20.5576 -19.1753 -18.7425 -16.5541 -15.3836 -3.0862 -2.5972 -1.2873 -1.1408 -0.8874 -0.3819 0.3678 0.9017 1.5211 2.4946 2.6771 3.5748 3.6799 4.0313 5.0544 5.9328 6.3208 6.5015 6.9386 7.7429 8.0387 8.2275 8.4945 8.8601 9.2026 9.5618 9.9518 10.5424 11.6192 11.7541 12.4034 12.7493 14.1016 14.6182 14.7770 16.1953 16.6609 18.4795 18.6289 18.7676 20.2699 20.7428 22.1394 22.2460 22.8123 23.0827 23.8109 23.8611 23.9212 25.6835 26.8445 27.3815 28.2328 28.4853 28.8445 30.1400 30.5932 30.8636 30.9639 31.3184 33.2792 34.4860 35.8598 36.0769 36.2416 36.5681 37.2627 37.5295 37.6810 39.3398 40.9446 41.4239 42.0353 43.0762 45.0773 46.8115 47.7925 48.5428 49.7778 50.0972 51.6112 53.3776 54.2056 54.2110 57.2474 58.8208 59.5988 60.8319 61.1164 61.5818 65.1027 66.2741 67.4347 68.7389 69.5241 69.7719 70.2606 70.9714 72.4049 73.3867 73.7253 74.4130 74.8556 77.1064 77.6771 77.9657 79.4679 79.4952 79.9911 80.5296 80.7062 81.3013 82.2931 83.0557 83.5875 83.9197 84.1663 84.8605 85.3979 85.6414 86.8830 86.9266 88.0776 88.3132 88.8686 90.4455 90.4550 90.4924 92.6981 92.9322 94.7001 94.8632 95.8578 96.6874 96.7920 98.1862 99.0456 99.5937 100.8710 102.4935 102.8928 103.5516 104.1738 105.1522 105.7033 106.5182 107.5484 107.6753 108.9664 109.3117 111.1768 111.4591 112.4020 112.9911 113.0115 113.8279 114.4890 115.4711 116.9231 117.9695 119.5093 120.5127 121.8328 123.0248 126.5527 126.7303 126.8935 129.4745 131.1847 131.6222 132.5037 132.8440 135.0308 135.7754 137.7413 138.5381 138.8799 140.6571 141.2523 143.6727 144.4352 145.7419 146.9584 148.1716 148.5146 149.1648 151.8090 154.1019 155.1289 155.6031 156.9563 160.0306 160.1559 161.9312 162.4164 166.3266 170.3885 171.6117 171.6397 173.0706 174.4732 175.2537 175.6353 175.8756 176.9746 179.6264 180.5895 184.6056 184.6597 187.1390 192.0334 195.7563 201.3619 202.4814 629.4584 633.0535 891.7627 1190.9934 1192.6792 electronvolt
chargesum: 1.0000000
charge: 0.094733 0.210158 -0.116724 0.210155 0.211717 0.328407 0.167104 0.167117 -0.228229 -0.295316 0.250878
charge: 0.612831 0.066445 0.045474 0.066427 0.064523 -0.458015 0.051814 0.051809 0.199185 0.357030 -0.057523
qa: 0.0947 0.2102 -0.1167 0.2102 0.2117 0.3284 0.1671 0.1671 -0.2282 -0.2953 0.2509
va: 3.7290 0.9897 3.7978 0.9897 0.9833 4.2835 0.9959 0.9960 2.2611 2.1850 1.0098
dispcorr: -0.002225911 hartree
energy: -284.827429733772
dipole: -6.24239 3.02632 -3.21607 -0.15108 0.64165 0.49057 0.00039 -0.00050 -0.00011
magnitude: 3.25327 au
magnitude: 8.26915 debye
temp: 298.15 k
press: 1.00 atm
zeropoint: 0.09540046 hartree
thermalvibcorrection: 0.00297883 hartree
thermalrotcorrection: 0.00141627 hartree
thermaltrasncorrection: 0.00141627 hartree
thermaltotal: -284.72621790 hartree
thermalcorr: 0.00581138 hartree
nonthermalcorr: 0.09540046 hartree
totalcorr: 0.10121183 hartree
thermalcorrenthalpy: 0.00094421 hartree
totalenthalpy: -284.72527369 hartree
totalentropycorr: -0.03603041 hartree
gibbsenthalpy: -284.76130410 hartree
gibbsminuselec: 0.06612563 hartree
