program: Orca
programVersion: 5.0.3
elementType: C O C O C C N C O C O C C C C C C C C C C C H H H H H H H H H H H H H H H H H H H H
charge: 1
multiplicity: 1
keywords: wB97X-D3 TightOpt Freq def2-TZVPP def2/J RIJCOSX TightSCF defgrid3 CHELPG
frequency: 0.00 0.00 0.00 0.00 0.00 0.00 36.09 40.58 54.01 60.43 71.24 93.97 114.68 119.23 127.51 142.94 156.52 164.14 203.20 216.25 225.53 229.91 233.68 264.48 305.42 319.33 331.50 333.55 352.41 375.99 405.57 486.85 500.14 515.66 535.70 540.32 564.39 596.81 607.36 617.59 647.42 663.78 686.32 737.99 773.93 781.06 784.33 815.01 820.62 859.88 889.88 911.18 921.79 944.62 946.33 968.22 972.85 991.32 1009.49 1023.88 1041.32 1056.11 1060.63 1070.41 1072.57 1101.75 1121.00 1136.88 1149.22 1161.66 1176.70 1184.58 1196.45 1205.02 1224.49 1261.59 1272.89 1284.79 1298.02 1302.25 1321.20 1325.27 1365.26 1398.60 1421.57 1427.69 1431.83 1439.20 1449.91 1475.49 1492.41 1494.10 1497.20 1498.00 1498.78 1500.31 1504.90 1507.15 1510.33 1529.58 1535.37 1540.02 1604.15 1670.81 1684.35 1689.02 3057.93 3060.84 3065.59 3085.68 3089.18 3121.38 3127.35 3163.80 3165.98 3168.68 3176.63 3187.07 3205.41 3206.39 3212.45 3227.97 3283.16 3290.92 3305.63 3895.63
frequency: 36.09 40.58 54.01 60.43 71.24 93.97 114.68 119.23 127.51 142.94 156.52 164.14 203.20 216.25 225.53 229.91 233.68 264.48 305.42 319.33 331.50 333.55 352.41 375.99 405.57 486.85 500.14 515.66 535.70 540.32 564.39 596.81 607.36 617.59 647.42 663.78 686.32 737.99 773.93 781.06 784.33 815.01 820.62 859.88 889.88 911.18 921.79 944.62 946.33 968.22 972.85 991.32 1009.49 1023.88 1041.32 1056.11 1060.63 1070.41 1072.57 1101.75 1121.00 1136.88 1149.22 1161.66 1176.70 1184.58 1196.45 1205.02 1224.49 1261.59 1272.89 1284.79 1298.02 1302.25 1321.20 1325.27 1365.26 1398.60 1421.57 1427.69 1431.83 1439.20 1449.91 1475.49 1492.41 1494.10 1497.20 1498.00 1498.78 1500.31 1504.90 1507.15 1510.33 1529.58 1535.37 1540.02 1604.15 1670.81 1684.35 1689.02 3057.93 3060.84 3065.59 3085.68 3089.18 3121.38 3127.35 3163.80 3165.98 3168.68 3176.63 3187.07 3205.41 3206.39 3212.45 3227.97 3283.16 3290.92 3305.63 3895.63
formula: C17H20NO4
InChI: InChI=1S/C17H20NO4/c1-11-7-5-8-12(2)15(11)18-13(3)17(19,20-4)22-16(18)14-9-6-10-21-14/h5-10,13,19H,1-4H3
42 atoms
C  4.069053 -0.163093 1.323683
O  2.830834 -0.7800 0.934243
C  2.460485 -0.667738 -0.344826
O  3.498003 -0.864813 -1.187635
C  1.171816 -1.460577 -0.613475
C  1.029605 -2.741014 0.174267
N  0.137397 -0.446858 -0.323881
C  0.665915 0.751575 -0.385465
O  1.955179 0.758477 -0.5733
C  0.007398 2.013224 -0.287345
O  -1.347716 2.073505 -0.270693
C  -1.671161 3.369382 -0.186513
C  -0.560419 4.154178 -0.147551
C  0.538896 3.27058 -0.216688
C  -1.221148 -0.780172 0.014292
C  -2.072018 -1.209924 -1.002612
C  -1.620499 -1.291567 -2.434073
C  -3.367256 -1.56104 -0.646399
C  -3.784796 -1.484195 0.671423
C  -2.916407 -1.049146 1.65746
C  -1.611211 -0.685774 1.350134
C  -0.687395 -0.177943 2.42212
H  4.085147 0.883792 1.023132
H  4.910115 -0.693808 0.885072
H  4.09873 -0.239345 2.405387
H  1.132727 -1.676625 -1.685577
H  1.039535 -2.55489 1.245012
H  1.862407 -3.399215 -0.06888
H  0.103239 -3.247319 -0.091465
H  -2.725347 3.59003 -0.164686
H  -0.536212 5.228125 -0.079412
H  1.587797 3.516521 -0.21442
H  -2.477033 -1.353012 -3.101455
H  -1.012026 -2.181599 -2.6115
H  -1.03493 -0.418887 -2.727424
H  -4.054499 -1.894507 -1.413509
H  -4.796977 -1.764666 0.931911
H  -3.251453 -0.991126 2.685243
H  -1.054741 -0.46111 3.405871
H  -0.626477 0.913079 2.400368
H  0.327173 -0.5626 2.318452
H  3.239473 -0.750457 -2.104267
totalener: -1015.36330513 hartree
nucrepener: 1953.18477216 hartree
electener: -2968.54807729 hartree
oneelecener: -5241.99791108 hartree
twoeener: 2273.44983379 hartree
kineticenergy: 1010.26491060 hartree
xcener: -97.138944260088 hartree
chargesum: 1.0000000
charge: -0.131070 -0.288168 0.470582 -0.255633 -0.065287 -0.237865 0.124475 0.395137 -0.254195 0.125927 -0.229055 0.013930 -0.121854 -0.184206 -0.000353 -0.126510 -0.284836 -0.014346 -0.132796 -0.021088 -0.120490 -0.246293 0.112054 0.131362 0.128064 0.105799 0.109900 0.122445 0.121417 0.169329 0.170646 0.178262 0.112054 0.105327 0.102488 0.126110 0.147471 0.125820 0.112279 0.106180 0.091053 0.205933
charge: -0.012373 0.293682 -0.472006 0.381590 -0.079652 0.043863 0.352819 -0.243293 0.319221 -0.215942 0.417877 -0.055757 -0.013818 0.045839 -0.115942 -0.070927 0.031673 0.009917 0.017297 0.010277 -0.068198 0.032564 0.007936 0.012282 0.017018 0.037664 0.025392 0.035806 0.028457 0.024104 0.029180 0.035287 0.031656 0.021694 0.018634 0.030546 0.032827 0.030663 0.030313 0.024444 0.015306 -0.097920
qa: -0.1311 -0.2882 0.4706 -0.2556 -0.0653 -0.2379 0.1245 0.3951 -0.2542 0.1259 -0.2291 0.0139 -0.1219 -0.1842 -0.0004 -0.1265 -0.2848 -0.0143 -0.1328 -0.0211 -0.1205 -0.2463 0.1121 0.1314 0.1281 0.1058 0.1099 0.1224 0.1214 0.1693 0.1706 0.1783 0.1121 0.1053 0.1025 0.1261 0.1475 0.1258 0.1123 0.1062 0.0911 0.2059
va: 3.8631 2.1040 4.1923 2.1924 3.9345 3.9669 3.1115 3.9895 2.2060 3.4304 2.3310 3.9662 3.9669 4.0383 3.4458 3.9068 3.9192 3.8733 4.0166 3.8893 3.9511 3.9289 0.9931 0.9932 0.9911 1.0143 1.0048 1.0099 0.9992 0.9943 0.9989 1.0036 1.0125 0.9912 0.9957 1.0085 0.9970 1.0080 1.0095 0.9921 1.0121 1.0374
dispcorr: -0.024013099 hartree
energy: -1015.390345814478
dipole: 0.94506 -0.57723 0.36783 -8.04608 8.75162 0.70555 3.00861 -3.48871 -0.48010
magnitude: 0.92930 au
magnitude: 2.36209 debye
temp: 298.15 k
press: 1.00 atm
zeropoint: 0.34942850 hartree
thermalvibcorrection: 0.01820278 hartree
thermalrotcorrection: 0.00141627 hartree
thermaltrasncorrection: 0.00141627 hartree
thermaltotal: -1015.01988199 hartree
thermalcorr: 0.02103532 hartree
nonthermalcorr: 0.34942850 hartree
totalcorr: 0.37046382 hartree
thermalcorrenthalpy: 0.00094421 hartree
totalenthalpy: -1015.01893778 hartree
totalentropycorr: -0.06872002 hartree
gibbsenthalpy: -1015.08765781 hartree
gibbsminuselec: 0.30268801 hartree
