program: Orca
programVersion: 5.0.3
elementType: C N C C O N C C C C C C H H H H H H H H H H H H H
charge: 1
multiplicity: 1
keywords: wB97X-D3 TightOpt Freq def2-TZVPP def2/J RIJCOSX TightSCF defgrid3 CHELPG
frequency: 0.00 0.00 0.00 0.00 0.00 0.00 52.83 67.47 87.04 130.02 154.05 186.27 253.70 282.84 322.99 359.00 401.32 421.93 443.56 476.50 501.84 529.56 594.71 633.85 672.07 721.67 723.61 768.49 808.16 871.22 901.77 964.42 1025.01 1032.04 1054.48 1061.21 1072.42 1092.47 1120.79 1130.78 1176.64 1191.15 1194.44 1209.44 1258.94 1280.92 1314.94 1333.41 1363.80 1416.19 1466.18 1478.88 1493.13 1496.41 1505.81 1514.42 1515.60 1550.49 1619.73 1680.53 1681.67 1757.17 3087.40 3089.58 3166.35 3169.99 3202.46 3206.48 3208.92 3214.86 3219.40 3228.52 3237.82 3635.31 3863.23
frequency: 52.83 67.47 87.04 130.02 154.05 186.27 253.70 282.84 322.99 359.00 401.32 421.93 443.56 476.50 501.84 529.56 594.71 633.85 672.07 721.67 723.61 768.49 808.16 871.22 901.77 964.42 1025.01 1032.04 1054.48 1061.21 1072.42 1092.47 1120.79 1130.78 1176.64 1191.15 1194.44 1209.44 1258.94 1280.92 1314.94 1333.41 1363.80 1416.19 1466.18 1478.88 1493.13 1496.41 1505.81 1514.42 1515.60 1550.49 1619.73 1680.53 1681.67 1757.17 3087.40 3089.58 3166.35 3169.99 3202.46 3206.48 3208.92 3214.86 3219.40 3228.52 3237.82 3635.31 3863.23
formula: C9H13N2O
InChI: InChI=1S/C9H13N2O/c1-11(2)9(12)10-8-6-4-3-5-7-8/h3-7,10,12H,1-2H3
25 atoms
C  -3.16204 1.197551 0.076577
N  -1.899591 0.551039 -0.291767
C  -1.038724 1.317391 -1.191574
C  -1.626375 -0.669232 0.096286
O  -2.644362 -1.374509 0.553536
N  -0.424862 -1.247247 0.033961
C  0.855256 -0.59721 0.08691
C  1.828118 -0.958472 -0.831078
C  3.076641 -0.361505 -0.760174
C  3.33859 0.595023 0.209732
C  2.356644 0.945355 1.124389
C  1.11075 0.340071 1.075392
H  -2.951383 2.24174 0.298059
H  -3.594373 0.724704 0.950997
H  -3.867292 1.139427 -0.751736
H  -1.684466 1.840617 -1.893581
H  -0.379371 0.659611 -1.747255
H  -0.443959 2.041907 -0.636661
H  -0.41578 -2.255188 0.034303
H  1.611687 -1.694345 -1.595761
H  3.843509 -0.641293 -1.469845
H  4.312739 1.062651 0.257788
H  2.564123 1.679838 1.89098
H  0.351376 0.587939 1.80714
H  -2.364521 -2.115633 1.098686
totalener: -535.34012897 hartree
nucrepener: 704.82134619 hartree
electener: -1240.16147516 hartree
oneelecener: -2108.42062062 hartree
twoeener: 868.25914545 hartree
kineticenergy: 532.55160288 hartree
xcener: -52.174153529549 hartree
chargesum: 1.0000000
charge: -0.152163 -0.100904 -0.168930 0.448148 -0.225574 -0.180976 0.162079 -0.201773 -0.073058 -0.108987 -0.078426 -0.245044 0.128928 0.120094 0.134325 0.141778 0.127299 0.138608 0.160213 0.145430 0.153919 0.155024 0.154064 0.144364 0.221560
charge: 0.040482 0.295111 0.040563 -0.321787 0.436466 0.365080 -0.149994 -0.003513 0.017684 0.018604 0.012484 -0.007208 0.028725 0.023007 0.027600 0.031416 0.028189 0.026559 0.004561 0.030230 0.034579 0.034070 0.033563 0.027763 -0.074235
qa: -0.1522 -0.1009 -0.1689 0.4481 -0.2256 -0.1810 0.1621 -0.2018 -0.0731 -0.1090 -0.0784 -0.2450 0.1289 0.1201 0.1343 0.1418 0.1273 0.1386 0.1602 0.1454 0.1539 0.1550 0.1541 0.1444 0.2216
va: 3.8566 3.3186 3.8615 4.1248 2.2791 3.2675 3.5534 4.0533 3.9669 3.9758 3.9665 4.0440 0.9885 1.0083 0.9897 0.9950 0.9965 0.9856 1.0221 1.0080 0.9950 0.9946 0.9953 1.0062 1.0295
dispcorr: -0.009718539 hartree
energy: -535.351468290640
dipole: -3.10741 1.71713 -1.39028 5.26963 -5.65594 -0.38630 -1.79761 1.84547 0.04786
magnitude: 1.44374 au
magnitude: 3.66970 debye
temp: 298.15 k
press: 1.00 atm
zeropoint: 0.21631279 hartree
thermalvibcorrection: 0.00884591 hartree
thermalrotcorrection: 0.00141627 hartree
thermaltrasncorrection: 0.00141627 hartree
thermaltotal: -535.12347705 hartree
thermalcorr: 0.01167845 hartree
nonthermalcorr: 0.21631279 hartree
totalcorr: 0.22799124 hartree
thermalcorrenthalpy: 0.00094421 hartree
totalenthalpy: -535.12253284 hartree
totalentropycorr: -0.04928379 hartree
gibbsenthalpy: -535.17181663 hartree
gibbsminuselec: 0.17965166 hartree
