program: Orca
programVersion: 5.0.3
elementType: C N C C O N C C C C C C H H H H H H H H H H H H H
charge: 1
multiplicity: 1
keywords: wB97X-D3 TightOpt Freq def2-TZVPP def2/J RIJCOSX TightSCF defgrid3 CHELPG
frequency: 0.00 0.00 0.00 0.00 0.00 0.00 12.13 52.71 76.05 86.58 96.94 155.58 232.14 257.33 276.08 389.41 406.31 422.81 456.62 468.54 506.28 530.34 593.93 634.37 648.17 722.83 754.51 784.58 842.58 880.52 899.32 982.67 1031.36 1032.37 1053.62 1060.07 1064.39 1097.88 1116.65 1129.16 1176.74 1194.75 1196.38 1205.24 1255.26 1294.91 1322.04 1328.56 1360.53 1442.79 1464.86 1485.82 1500.24 1506.78 1509.20 1513.15 1526.07 1551.92 1590.39 1671.12 1678.71 1760.86 3061.90 3087.72 3135.39 3162.99 3194.96 3210.17 3212.38 3220.65 3224.36 3230.91 3238.13 3668.93 3749.96
frequency: 12.13 52.71 76.05 86.58 96.94 155.58 232.14 257.33 276.08 389.41 406.31 422.81 456.62 468.54 506.28 530.34 593.93 634.37 648.17 722.83 754.51 784.58 842.58 880.52 899.32 982.67 1031.36 1032.37 1053.62 1060.07 1064.39 1097.88 1116.65 1129.16 1176.74 1194.75 1196.38 1205.24 1255.26 1294.91 1322.04 1328.56 1360.53 1442.79 1464.86 1485.82 1500.24 1506.78 1509.20 1513.15 1526.07 1551.92 1590.39 1671.12 1678.71 1760.86 3061.90 3087.72 3135.39 3162.99 3194.96 3210.17 3212.38 3220.65 3224.36 3230.91 3238.13 3668.93 3749.96
formula: C9H13N2O
InChI: InChI=1S/C9H13N2O/c1-11(2)9(12)10-8-6-4-3-5-7-8/h3-7,10,12H,1-2H3
25 atoms
C  3.640289 -0.939253 0.322908
N  2.616447 0.050554 -0.015931
C  3.064222 1.366349 -0.458798
C  1.33259 -0.21358 0.072154
O  0.980388 -1.40848 0.472708
N  0.391742 0.67989 -0.227941
C  -1.013565 0.379123 -0.12871
C  -1.660638 -0.21395 -1.205009
C  -3.012233 -0.503843 -1.102743
C  -3.701829 -0.197325 0.061426
C  -3.046739 0.397215 1.130535
C  -1.694792 0.687948 1.041202
H  4.260732 -1.12742 -0.551949
H  3.178657 -1.866681 0.639546
H  4.25926 -0.552336 1.130932
H  4.149333 1.36824 -0.476708
H  2.737246 2.14689 0.230461
H  2.711172 1.583145 -1.468411
H  0.670983 1.598669 -0.526502
H  -1.11227 -0.436671 -2.111835
H  -3.526525 -0.963794 -1.935678
H  -4.757608 -0.421723 0.135595
H  -3.588099 0.637168 2.035629
H  -1.171596 1.154493 1.866372
H  0.016641 -1.493465 0.500563
totalener: -535.34980364 hartree
nucrepener: 691.91661163 hartree
electener: -1227.26641527 hartree
oneelecener: -2082.56102951 hartree
twoeener: 855.29461424 hartree
kineticenergy: 532.54842776 hartree
xcener: -52.176015853455 hartree
chargesum: 1.0000000
charge: -0.175484 -0.108486 -0.185481 0.486990 -0.233940 -0.187226 0.035324 -0.192214 -0.072044 -0.093371 -0.075353 -0.175124 0.129946 0.132681 0.130397 0.119506 0.131311 0.129182 0.192059 0.152599 0.156301 0.157476 0.155954 0.147547 0.241451
charge: 0.038264 0.279282 0.028058 -0.316428 0.443045 0.368461 -0.157667 -0.000689 0.017074 0.027559 0.018157 0.002026 0.025734 0.023871 0.025808 0.036137 0.022302 0.022226 -0.002724 0.032540 0.035064 0.036261 0.035129 0.032422 -0.071911
qa: -0.1755 -0.1085 -0.1855 0.4870 -0.2339 -0.1872 0.0353 -0.1922 -0.0720 -0.0934 -0.0754 -0.1751 0.1299 0.1327 0.1304 0.1195 0.1313 0.1292 0.1921 0.1526 0.1563 0.1575 0.1560 0.1475 0.2415
va: 3.8627 3.3065 3.8544 4.1006 2.2932 3.2543 3.6311 4.0929 3.9493 3.9612 3.9500 4.0991 0.9864 1.0094 0.9864 1.0046 0.9867 0.9873 1.0037 1.0053 0.9958 0.9944 0.9959 1.0080 1.0296
dispcorr: -0.008643397 hartree
energy: -535.360026689621
dipole: 7.92749 -6.41369 1.51380 1.62033 -1.18391 0.43642 -0.52329 0.38815 -0.13514
magnitude: 1.58124 au
magnitude: 4.01919 debye
temp: 298.15 k
press: 1.00 atm
zeropoint: 0.21571873 hartree
thermalvibcorrection: 0.00928096 hartree
thermalrotcorrection: 0.00141627 hartree
thermaltrasncorrection: 0.00141627 hartree
thermaltotal: -535.13219446 hartree
thermalcorr: 0.01211350 hartree
nonthermalcorr: 0.21571873 hartree
totalcorr: 0.22783223 hartree
thermalcorrenthalpy: 0.00094421 hartree
totalenthalpy: -535.13125025 hartree
totalentropycorr: -0.05089032 hartree
gibbsenthalpy: -535.18214057 hartree
gibbsminuselec: 0.17788612 hartree
