program: Orca
programVersion: 5.0.3
elementType: C S C N C C C O N N C C C C C C C C C C C C H H H H H H H H H H H H H H H H H H
charge: 1
multiplicity: 1
keywords: wB97X-D3 TightOpt Freq def2-TZVPP def2/J RIJCOSX TightSCF defgrid3 CHELPG
frequency: 0.00 0.00 0.00 0.00 0.00 0.00 19.60 27.72 31.28 37.33 56.96 79.33 99.02 122.70 142.89 149.84 189.02 199.20 223.33 242.42 259.68 264.07 307.40 326.82 334.33 351.03 394.04 416.76 418.78 472.79 495.89 507.82 528.24 569.88 579.98 627.40 634.80 637.52 649.82 673.84 695.02 718.00 728.56 737.50 749.35 766.34 787.11 807.42 843.87 851.32 865.93 880.24 933.70 958.11 962.59 978.32 990.80 1008.94 1013.36 1025.92 1027.91 1029.79 1044.07 1056.43 1064.43 1067.66 1097.82 1111.90 1120.09 1133.97 1176.82 1181.88 1189.90 1194.70 1216.12 1218.69 1239.10 1266.27 1269.12 1317.88 1331.16 1332.91 1365.53 1370.09 1376.41 1420.79 1466.41 1474.10 1483.82 1490.30 1495.81 1502.55 1517.66 1545.68 1548.93 1554.42 1666.06 1675.76 1681.53 1688.07 1688.94 1726.27 3083.41 3091.79 3164.89 3183.37 3192.66 3194.80 3196.01 3197.27 3199.52 3211.90 3216.36 3220.43 3223.98 3228.35 3235.61 3236.52 3616.45 3744.90
frequency: 19.60 27.72 31.28 37.33 56.96 79.33 99.02 122.70 142.89 149.84 189.02 199.20 223.33 242.42 259.68 264.07 307.40 326.82 334.33 351.03 394.04 416.76 418.78 472.79 495.89 507.82 528.24 569.88 579.98 627.40 634.80 637.52 649.82 673.84 695.02 718.00 728.56 737.50 749.35 766.34 787.11 807.42 843.87 851.32 865.93 880.24 933.70 958.11 962.59 978.32 990.80 1008.94 1013.36 1025.92 1027.91 1029.79 1044.07 1056.43 1064.43 1067.66 1097.82 1111.90 1120.09 1133.97 1176.82 1181.88 1189.90 1194.70 1216.12 1218.69 1239.10 1266.27 1269.12 1317.88 1331.16 1332.91 1365.53 1370.09 1376.41 1420.79 1466.41 1474.10 1483.82 1490.30 1495.81 1502.55 1517.66 1545.68 1548.93 1554.42 1666.06 1675.76 1681.53 1688.07 1688.94 1726.27 3083.41 3091.79 3164.89 3183.37 3192.66 3194.80 3196.01 3197.27 3199.52 3211.90 3216.36 3220.43 3223.98 3228.35 3235.61 3236.52 3616.45 3744.90
formula: C17H18N3OS
InChI: InChI=1S/C17H18N3OS/c1-17(13-9-5-3-6-10-13)15(21)20(16(18-17)22-2)19-14-11-7-4-8-12-14/h3-12,19,21H,1-2H3
40 atoms
C  -0.222898 3.982256 -1.638638
S  1.019672 3.034221 -0.747679
C  -0.024823 1.901988 0.010671
N  -1.282894 1.764569 -0.046512
C  -1.674026 0.653995 0.814533
C  -2.518265 1.201752 1.974511
C  -0.349941 0.14749 1.326229
O  -0.094735 -0.857253 2.082749
N  0.600812 0.913142 0.85974
N  1.961641 0.758533 0.992678
C  2.528529 -0.399345 0.376567
C  3.672394 -0.947112 0.936966
C  4.274913 -2.034533 0.327538
C  3.735946 -2.581102 -0.827723
C  2.592355 -2.025685 -1.377342
C  1.985725 -0.928848 -0.783887
C  -2.324705 -0.500238 0.052984
C  -2.130635 -0.629255 -1.317176
C  -2.647873 -1.72312 -1.992665
C  -3.351662 -2.701201 -1.306904
C  -3.548729 -2.577394 0.059052
C  -3.039633 -1.480398 0.738328
H  0.327925 4.753195 -2.172485
H  -0.922729 4.438862 -0.944449
H  -0.751503 3.348562 -2.345256
H  -2.001264 2.030032 2.456965
H  -2.735405 0.443625 2.72477
H  -3.456187 1.567853 1.563811
H  2.256405 0.918284 1.94449
H  4.094831 -0.526155 1.841879
H  5.1685 -2.459794 0.76479
H  4.207189 -3.433485 -1.297491
H  2.16802 -2.439809 -2.282446
H  1.106342 -0.492102 -1.241562
H  -1.597396 0.139365 -1.860057
H  -2.503325 -1.80807 -3.061607
H  -3.755142 -3.553214 -1.837569
H  -4.112209 -3.327023 0.59856
H  -3.249404 -1.384849 1.797722
H  -0.881496 -1.406623 2.216611
totalener: -1296.12744345 hartree
nucrepener: 1941.60102906 hartree
electener: -3237.72847251 hartree
oneelecener: -5604.84071220 hartree
twoeener: 2367.11223969 hartree
kineticenergy: 1290.75005886 hartree
xcener: -107.173111704030 hartree
chargesum: 1.0000000
charge: -0.235063 0.074297 0.100922 -0.351437 0.352276 -0.219134 0.151444 -0.175012 0.110787 -0.180314 0.190725 -0.178484 -0.092552 -0.134784 -0.104030 -0.178017 0.168789 -0.259693 -0.082900 -0.112883 -0.122360 -0.302973 0.138448 0.131198 0.125594 0.123041 0.092021 0.141785 0.151073 0.116456 0.144875 0.145392 0.138417 0.109704 0.146169 0.148339 0.151477 0.150567 0.166882 0.258953
charge: -0.159248 0.704839 -0.513220 0.162036 -0.209090 0.065035 -0.174468 0.495578 0.266773 0.260437 -0.156895 -0.008629 0.011363 -0.001921 0.005417 -0.024635 -0.068882 0.010426 0.014970 0.017550 0.010294 -0.019653 0.010300 0.006535 0.004504 0.029894 0.017176 0.042714 -0.023174 0.024150 0.031566 0.028114 0.028959 0.015770 0.025337 0.031889 0.032622 0.031929 0.019818 -0.046180
qa: -0.2351 0.0743 0.1009 -0.3514 0.3523 -0.2191 0.1514 -0.1750 0.1108 -0.1803 0.1907 -0.1785 -0.0926 -0.1348 -0.1040 -0.1780 0.1688 -0.2597 -0.0829 -0.1129 -0.1224 -0.3030 0.1384 0.1312 0.1256 0.1230 0.0920 0.1418 0.1511 0.1165 0.1449 0.1454 0.1384 0.1097 0.1462 0.1483 0.1515 0.1506 0.1669 0.2590
va: 3.9450 2.5195 4.1887 2.9760 3.8989 3.9104 4.2242 2.3517 3.4065 3.0382 3.7270 4.0181 4.0120 3.9839 4.0015 3.9992 3.3701 4.0878 3.9486 4.0011 4.0730 4.0553 1.0015 1.0062 1.0057 1.0086 1.0120 1.0028 1.0300 1.0150 0.9967 0.9965 0.9994 1.0186 1.0051 0.9969 0.9950 0.9986 0.9924 1.0080
dispcorr: -0.021083661 hartree
energy: -1296.151846518863
dipole: -6.56691 5.82577 -0.74114 -3.11189 3.14115 0.02926 -1.10639 2.27676 1.17038
magnitude: 1.38561 au
magnitude: 3.52195 debye
temp: 298.15 k
press: 1.00 atm
zeropoint: 0.32632447 hartree
thermalvibcorrection: 0.01718399 hartree
thermalrotcorrection: 0.00141627 hartree
thermaltrasncorrection: 0.00141627 hartree
thermaltotal: -1295.80550551 hartree
thermalcorr: 0.02001653 hartree
nonthermalcorr: 0.32632447 hartree
totalcorr: 0.34634101 hartree
thermalcorrenthalpy: 0.00094421 hartree
totalenthalpy: -1295.80456130 hartree
totalentropycorr: -0.06749469 hartree
gibbsenthalpy: -1295.87205600 hartree
gibbsminuselec: 0.27979052 hartree
