program: Orca
programVersion: 5.0.3
elementType: N C N C N N C N C C C N H H H H H H H H H H H
charge: 1
multiplicity: 1
keywords: wB97X-D3 TightOpt Freq def2-TZVPP def2/J RIJCOSX TightSCF defgrid3 CHELPG
frequency: 0.00 0.00 0.00 0.00 0.00 0.00 54.35 68.16 123.21 154.08 188.15 196.69 285.31 311.82 325.74 368.60 412.23 470.82 485.39 511.23 544.93 570.25 581.12 627.20 639.26 738.67 745.43 758.75 779.49 822.41 853.59 868.62 982.23 994.56 1006.90 1022.34 1068.55 1087.50 1108.37 1138.60 1178.38 1200.23 1204.04 1216.62 1261.64 1316.29 1401.86 1409.03 1460.40 1473.52 1522.71 1542.92 1575.07 1604.75 1648.98 1702.98 1703.74 1752.22 3168.11 3177.38 3198.26 3257.70 3270.89 3639.75 3643.19 3659.31 3664.69 3769.21 3772.64
frequency: 54.35 68.16 123.21 154.08 188.15 196.69 285.31 311.82 325.74 368.60 412.23 470.82 485.39 511.23 544.93 570.25 581.12 627.20 639.26 738.67 745.43 758.75 779.49 822.41 853.59 868.62 982.23 994.56 1006.90 1022.34 1068.55 1087.50 1108.37 1138.60 1178.38 1200.23 1204.04 1216.62 1261.64 1316.29 1401.86 1409.03 1460.40 1473.52 1522.71 1542.92 1575.07 1604.75 1648.98 1702.98 1703.74 1752.22 3168.11 3177.38 3198.26 3257.70 3270.89 3639.75 3643.19 3659.31 3664.69 3769.21 3772.64
formula: C6H11N6
InChI: InChI=1S/C6H11N6/c7-4-10-5(8)12-6(11-4)9-3-1-2-3/h3,9,11H,1-2,7-8H2
23 atoms
N  3.134596 -1.663665 0.215085
C  2.136163 -0.79474 0.083429
N  2.375077 0.48719 0.082299
C  1.303099 1.292128 -0.052428
N  1.527014 2.594447 -0.051315
N  0.026348 0.890698 -0.191984
C  -0.183391 -0.397322 -0.184251
N  -1.405626 -0.905271 -0.304238
C  -2.575915 -0.085234 -0.490366
C  -3.848752 -0.562218 0.131837
C  -3.145889 0.636977 0.687493
N  0.863884 -1.28323 -0.046817
H  4.064407 -1.294048 0.308898
H  3.008158 -2.658133 0.206818
H  2.46468 2.939769 0.046022
H  0.757203 3.230996 -0.151606
H  -1.516068 -1.901013 -0.391843
H  -2.620309 0.396137 -1.458131
H  -3.815753 -1.473154 0.714756
H  -4.758576 -0.423424 -0.433066
H  -2.634327 0.524162 1.632817
H  -3.56431 1.616662 0.510503
H  0.692476 -2.274436 -0.020217
totalener: -563.64531698 hartree
nucrepener: 708.12263093 hartree
electener: -1271.76794791 hartree
oneelecener: -2154.11059579 hartree
twoeener: 882.34264788 hartree
kineticenergy: 560.78002265 hartree
xcener: -53.874219772759 hartree
chargesum: 1.0000000
charge: -0.215263 0.395270 -0.368626 0.393383 -0.200322 -0.370121 0.400467 -0.166961 -0.013919 -0.146060 -0.084446 -0.156122 0.209379 0.166052 0.195316 0.195984 0.143407 0.115661 0.088645 0.102935 0.080190 0.094402 0.140746
charge: 0.407364 -0.294542 0.132244 -0.321938 0.422896 0.145365 -0.278243 0.361981 -0.090585 0.027054 0.028948 0.375282 0.008617 -0.014122 0.000064 0.000128 -0.010680 0.022816 0.015385 0.021906 0.017119 0.020615 0.002325
qa: -0.2153 0.3953 -0.3686 0.3934 -0.2003 -0.3701 0.4005 -0.1670 -0.0139 -0.1461 -0.0844 -0.1561 0.2094 0.1661 0.1953 0.1960 0.1434 0.1157 0.0886 0.1029 0.0802 0.0944 0.1407
va: 3.3209 4.2226 2.9969 4.2663 3.3329 3.0062 4.1550 3.2565 3.7720 3.9244 3.8668 3.3779 1.0052 1.0251 1.0104 1.0095 1.0277 1.0240 1.0222 1.0266 1.0275 1.0265 1.0377
dispcorr: -0.006981665 hartree
energy: -563.653921558541
dipole: -7.86188 8.96150 1.09962 -1.32312 -0.04501 -1.36813 0.97031 -1.00052 -0.03021
magnitude: 1.75552 au
magnitude: 4.46218 debye
temp: 298.15 k
press: 1.00 atm
zeropoint: 0.19430740 hartree
thermalvibcorrection: 0.00844600 hartree
thermalrotcorrection: 0.00141627 hartree
thermaltrasncorrection: 0.00141627 hartree
thermaltotal: -563.44833561 hartree
thermalcorr: 0.01127854 hartree
nonthermalcorr: 0.19430740 hartree
totalcorr: 0.20558595 hartree
thermalcorrenthalpy: 0.00094421 hartree
totalenthalpy: -563.44739140 hartree
totalentropycorr: -0.04848248 hartree
gibbsenthalpy: -563.49587388 hartree
gibbsminuselec: 0.15804768 hartree
