program: Orca
programVersion: 5.0.3
elementType: Cl Cl N N N C C C C C C C C C H H H H H H H H H H
charge: 1
multiplicity: 1
keywords: wB97X-D3 TightOpt Freq def2-TZVPP def2/J RIJCOSX TightSCF defgrid3 CHELPG
frequency: 0.00 0.00 0.00 0.00 0.00 0.00 23.31 51.51 64.00 110.31 165.81 178.87 200.41 205.19 290.17 300.50 325.70 353.33 415.79 449.60 486.46 490.93 522.31 554.74 560.95 670.68 715.62 722.63 737.86 799.91 825.32 834.51 878.50 909.00 957.92 959.69 1044.93 1046.56 1055.47 1107.57 1130.53 1138.41 1153.11 1197.51 1243.36 1244.04 1259.07 1283.68 1300.40 1328.90 1350.67 1388.35 1429.97 1485.82 1501.91 1518.04 1531.31 1543.87 1649.86 1656.02 1663.77 1738.22 3094.64 3096.86 3165.59 3175.84 3224.20 3239.53 3244.57 3650.02 3684.89 3696.84
frequency: 23.31 51.51 64.00 110.31 165.81 178.87 200.41 205.19 290.17 300.50 325.70 353.33 415.79 449.60 486.46 490.93 522.31 554.74 560.95 670.68 715.62 722.63 737.86 799.91 825.32 834.51 878.50 909.00 957.92 959.69 1044.93 1046.56 1055.47 1107.57 1130.53 1138.41 1153.11 1197.51 1243.36 1244.04 1259.07 1283.68 1300.40 1328.90 1350.67 1388.35 1429.97 1485.82 1501.91 1518.04 1531.31 1543.87 1649.86 1656.02 1663.77 1738.22 3094.64 3096.86 3165.59 3175.84 3224.20 3239.53 3244.57 3650.02 3684.89 3696.84
formula: C9H10Cl2N3
InChI: InChI=1S/C9H10Cl2N3/c10-6-2-1-3-7(11)8(6)14-9-12-4-5-13-9/h1-3,12-14H,4-5H2
24 atoms
Cl 1.130829 -2.696416 -0.278089
Cl 0.184345 2.602922 -0.571059
N  -2.815069 -0.445932 -0.820171
N  -0.46999 -0.291869 -0.954715
N  -1.717181 0.073267 1.001913
C  -3.845001 -0.456378 0.222697
C  -3.120784 0.247621 1.380537
C  -1.614269 -0.226498 -0.287316
C  0.793398 -0.022634 -0.359127
C  1.639843 -1.074723 -0.008516
C  1.214115 1.289693 -0.13873
C  2.881959 -0.823631 0.547411
C  2.451083 1.545969 0.427236
C  3.27688 0.486077 0.762834
H  -4.117244 -1.481328 0.476919
H  -4.731578 0.081531 -0.101563
H  -3.368415 1.308483 1.430524
H  -3.324744 -0.215587 2.341877
H  -2.942948 -0.874508 -1.719261
H  -0.49081 -0.608106 -1.910308
H  3.527337 -1.650513 0.80762
H  2.761721 2.568111 0.590719
H  4.2470 0.684825 1.198076
H  -0.947625 0.453749 1.524721
totalener: -1433.49905626 hartree
nucrepener: 1112.78143442 hartree
electener: -2546.28049069 hartree
oneelecener: -4159.62082692 hartree
twoeener: 1613.34033624 hartree
kineticenergy: 1429.92506289 hartree
xcener: -92.483834990517 hartree
chargesum: 1.0000000
charge: -0.010587 -0.009162 -0.169929 -0.178129 -0.161817 -0.043873 -0.036594 0.366560 0.138721 -0.045369 -0.081711 -0.071938 -0.055891 -0.109476 0.125136 0.124720 0.121474 0.125081 0.160534 0.179278 0.147178 0.148210 0.157351 0.180233
charge: 0.460423 0.460722 0.362769 0.364110 0.370245 0.006161 0.006902 -0.269075 -0.202050 -0.387687 -0.395174 -0.009266 -0.013533 0.030222 0.026431 0.030032 0.027006 0.030173 -0.010378 0.007125 0.036751 0.036207 0.040129 -0.008245
qa: -0.0106 -0.0092 -0.1699 -0.1781 -0.1618 -0.0439 -0.0366 0.3666 0.1387 -0.0454 -0.0817 -0.0719 -0.0559 -0.1095 0.1251 0.1247 0.1215 0.1251 0.1605 0.1793 0.1472 0.1482 0.1574 0.1802
va: 1.3134 1.3160 3.2934 3.2850 3.2927 3.9032 3.8880 4.2203 3.4269 4.1487 4.1095 3.9377 3.9369 3.9700 1.0034 1.0037 1.0048 1.0041 1.0237 1.0105 1.0038 1.0031 0.9930 1.0163
dispcorr: -0.011026016 hartree
energy: -1433.510102098216
dipole: -10.92700 8.78505 -2.14195 0.39400 -0.60125 -0.20725 5.65250 -5.42930 0.22320
magnitude: 2.16350 au
magnitude: 5.49918 debye
temp: 298.15 k
press: 1.00 atm
zeropoint: 0.18914679 hartree
thermalvibcorrection: 0.00994516 hartree
thermalrotcorrection: 0.00141627 hartree
thermaltrasncorrection: 0.00141627 hartree
thermaltotal: -1433.30817761 hartree
thermalcorr: 0.01277770 hartree
nonthermalcorr: 0.18914679 hartree
totalcorr: 0.20192449 hartree
thermalcorrenthalpy: 0.00094421 hartree
totalenthalpy: -1433.30723340 hartree
totalentropycorr: -0.05283280 hartree
gibbsenthalpy: -1433.36006619 hartree
gibbsminuselec: 0.15003590 hartree
