program: Gaussian 09
title: 000044819
version: EM64L-G09RevD.01
frameworkgroup: C1[X(C10H24N2S2)]
method: RPBEPBE
basis: SDD
operation: Freq
keyword: #p
keyword: freq=noraman
keyword: PBEPBE/SDD
title: #p freq=noraman PBEPBE/SDD
converged: YES YES NO NO
title: Mulliken charges:
elementType: S S N N C C C C C C C C C C H H H H H H H H H H H H H H H H H H H H H H H H
charge: -0.051886 -0.051836 -0.285986 -0.285949 -0.366430 -0.366573 -0.392804 -0.392684 -0.379533 -0.379597 -0.290994 -0.290955 -0.691086 -0.691161 0.188237 0.192719 0.188263 0.192730 0.218730 0.180455 0.218737 0.180439 0.213026 0.180610 0.180649 0.213016 0.240578 0.240556 0.228098 0.199854 0.228117 0.199800 0.243729 0.272898 0.243706 0.272912 0.099807 0.099808
chargesum: 0.00000
title: Mulliken charges with hydrogens summed into heavy atoms:
elementType: S S N N C C C C C C C C C C
charge: 0.047921 0.047972 -0.045408 -0.045394 0.014526 0.014420 0.006381 0.006491 0.014103 0.014068 0.136958 0.136962 -0.174459 -0.174543
polarizability: 2.37698503e+02 -2.68659525e+00 1.33417377e+02 2.61739217e-03 -1.61960223e-02 1.10103155e+02
1716.lowfreq: -2.5408 0.0011 0.0027 0.0029 4.7107 13.6290 20.1116 33.0128 38.8887
frequency: 13.6239 24.3465 34.4465 40.5453 59.2164 64.2111 82.6606 102.8393 109.5408 115.2502 132.3252 137.1517 144.0588 151.6515 154.6013 166.4884 169.0168 199.5240 234.8036 305.2518 323.8898 404.2161 430.0025 480.8647 508.0988 681.3900 685.3219 703.6201 704.3292 731.2758 753.2599 793.7533 796.1992 804.8991 819.9807 820.9309 885.2845 974.6411 977.8165 987.0038 996.6286 1015.8822 1039.1612 1042.4200 1067.6475 1072.7460 1080.5281 1094.8891 1111.2120 1113.5603 1125.3461 1144.2222 1145.8703 1190.8824 1213.1694 1222.2065 1235.0124 1249.4841 1259.7950 1267.0891 1275.5789 1276.0924 1281.1143 1285.4808 1293.1880 1295.3581 1319.7447 1341.5081 1353.5840 1359.7807 1390.5254 1391.5072 1450.7364 1450.9364 1457.6563 1457.9010 1465.3769 1466.4022 1471.7944 1482.1336 1487.3775 1489.6405 1497.7861 1498.5324 2443.2928 2443.4913 2851.9071 2851.9796 2873.6681 2873.7553 2955.2609 2955.3391 2958.6203 2966.5710 2994.4193 2997.9137 2998.2248 3015.0948 3019.2682 3019.3151 3030.2871 3030.3431 3038.6558 3049.7242 3110.1349 3110.1484 3421.7209 3421.7481
redmass: 6.8704 6.2394 5.0787 2.0098 4.6170 3.7908 1.7996 2.9081 3.9819 1.8182 8.4254 2.3523 1.6147 1.4335 1.1981 2.0671 2.0025 3.5019 5.9159 3.8765 4.6142 4.2008 3.5823 3.7812 3.1347 1.4239 1.3574 3.5569 3.8885 1.0680 1.0958 1.1266 1.1286 1.1631 1.1919 1.1888 1.2291 2.1551 1.3240 1.6144 4.2127 1.7732 2.7894 2.0715 2.6893 2.9148 2.1223 2.7466 2.3826 1.2487 1.3196 4.0081 3.8816 1.5977 1.5627 1.2905 1.3294 1.2274 1.2887 1.2074 1.0992 1.2382 1.0817 1.1566 1.1232 1.1204 1.2825 1.3229 1.4455 1.6517 1.4389 1.4570 1.1551 1.1521 1.1328 1.1377 1.0756 1.0647 1.0849 1.0951 1.0928 1.0925 1.0837 1.0865 1.0385 1.0385 1.0712 1.0712 1.0710 1.0710 1.0595 1.0623 1.0648 1.0623 1.0960 1.0848 1.0848 1.0997 1.0686 1.0686 1.0780 1.0780 1.1010 1.1029 1.1067 1.1067 1.0740 1.0740
irintensity: 0.3014 0.2490 0.0574 2.7576 1.2602 0.2010 2.2342 0.9678 5.3249 9.8576 0.0181 7.0024 6.4215 3.6976 45.0592 1.6143 2.6872 0.0758 4.9323 2.4628 0.4216 1.0500 3.7482 7.2844 0.1821 28.1512 154.1088 4.8799 26.6203 14.1525 1.2016 4.9200 2.3606 6.2572 10.6764 0.6246 2.7530 0.5623 0.8851 15.7161 0.7995 1.9035 0.1279 2.7221 4.6172 1.0483 0.0611 1.4526 0.8510 55.7460 0.6969 135.8580 0.4062 10.1496 1.3898 2.2123 5.1273 0.3751 40.1603 0.0202 6.3938 0.8306 1.5669 1.0761 0.2383 1.3152 4.4788 0.0026 11.2019 0.0042 0.4339 9.2887 50.2148 0.3951 27.9155 0.2892 2.3202 0.0112 0.0229 12.3738 0.0003 4.6715 0.1466 13.7036 41.5353 36.1671 111.1875 62.2664 131.2864 79.3024 2.5321 2.6958 3.5170 112.0149 4.5299 26.3677 41.2635 0.1112 12.6703 11.4704 36.0003 39.2421 1.5716 182.5134 2.5998 46.2806 1.4434 1.8929
temp: 298.150 k
press: 1.00000 atm
elementType: 16 16 7 7 6 6 6 6 6 6 6 6 6 6 1 1 1 1 1 1 1 1 1 1 1 1 1 1 1 1 1 1 1 1 1 1 1 1
symmnumber: 1
zpe: 863504.6 jmol-1
zpe.correction: 0.328892 hartree
zpe.thermalcorrener: 0.349068 hartree
zpe.thermalcorrenthalpy: 0.350012 hartree
zpe.thermalcorrgfe: 0.275679 hartree
zpe.sumelectzpe: -1299.853236 hartree
zpe.sumelectthermal: -1299.833060 hartree
zpe.sumelectthermalent: -1299.832115 hartree
zpe.sumelectthermalfe: -1299.906448 hartree
dipole: -0.0001 0.0014 1.1268
dipole: 1.1268
quadrupole: -132.0698 -104.1082 -104.7010
quadrupole: 22.4760 -0.0196 0.0001
quadrupole: -18.4435 9.5182 8.9253 22.4760 -0.0196 0.0001
hfenergy: -1300.1821273 hartree
pointgroup: C01 [X(C10H24N2S2)]
dipole: -0.0000541 0.0017303 0.4433291 debye
polarizability: 237.6494812|-3.5109773|133.4661426|0.0211695|-0.0789032|110.1034109 unknown
InChI: InChI=1S/C10H24N2S2/c13-9-7-11-5-3-1-2-4-6-12-8-10-14/h11-14H,1-10H2
charge 0 multiplicity 1
38 atoms
S  8.498324 -0.352128 -0.110888
S  -8.498923 0.348202 -0.114289
N  4.428068 0.377706 0.114274
N  -4.427986 -0.376039 0.115827
C  0.638734 -0.43297 0.113458
C  -0.638969 0.436239 0.11117
C  1.937792 0.403254 0.112967
C  -1.937828 -0.400319 0.11447
C  3.210545 -0.465361 0.101851
C  -3.210975 0.467658 0.098363
C  5.706179 -0.36373 0.075758
C  -5.706664 0.364096 0.071749
C  6.862225 0.620824 -0.162827
C  -6.861834 -0.623402 -0.158904
H  0.626678 -1.099107 1.001506
H  0.62907 -1.098051 -0.77495
H  -0.627235 1.106674 0.99597
H  -0.629171 1.096957 -0.780481
H  1.960301 1.072957 -0.768517
H  1.948378 1.059763 1.009668
H  -1.959763 -1.074582 -0.763533
H  -1.948512 -1.052187 1.014549
H  3.229966 -1.077124 -0.822114
H  3.173402 -1.184179 0.96039
H  -3.174156 1.191508 0.952667
H  -3.230789 1.073968 -0.82918
H  4.405334 1.048174 0.896625
H  -4.405164 -1.041328 0.902585
H  5.661793 -1.082233 -0.764304
H  5.904697 -0.95945 1.001666
H  -5.663034 1.076084 -0.773876
H  -5.905568 0.966776 0.993061
H  6.891624 1.393876 0.62493
H  6.750837 1.101317 -1.147002
H  -6.890244 -1.39022 0.634951
H  -6.750122 -1.111524 -1.139281
H  9.309486 0.696407 -0.512897
H  -9.308895 -0.704105 -0.508812
