program: Orca
programVersion: 5.0.3
elementType: C O C C C C C C N N C O O C C C C C C C C C H H H H H H H H H H H H H H H H H H H H H
charge: 1
multiplicity: 1
keywords: wB97X-D3 TightOpt Freq def2-TZVPP def2/J RIJCOSX TightSCF defgrid3 CHELPG
frequency: 0.00 0.00 0.00 0.00 0.00 0.00 18.80 39.28 43.50 56.05 65.85 80.56 87.69 120.09 129.50 152.85 185.23 201.69 219.24 228.73 240.99 261.07 270.44 293.88 301.72 329.98 370.53 379.49 419.03 419.85 440.77 445.89 473.99 504.58 512.30 542.82 574.43 611.01 620.15 635.05 646.47 697.22 721.56 728.72 746.91 761.42 786.28 797.69 817.70 847.97 865.47 880.86 917.30 930.05 954.24 954.87 957.59 971.81 999.46 1009.17 1021.52 1030.68 1046.96 1051.12 1059.61 1067.15 1089.82 1119.03 1120.35 1159.98 1183.26 1185.80 1187.61 1204.04 1215.61 1217.04 1218.08 1267.56 1275.65 1301.79 1317.10 1327.01 1349.44 1363.24 1366.40 1380.20 1395.60 1431.08 1439.86 1460.76 1471.72 1486.75 1487.33 1489.38 1500.33 1502.70 1506.39 1513.32 1514.07 1522.55 1546.59 1572.70 1634.91 1658.47 1674.40 1688.11 1689.79 1700.39 2843.83 3071.15 3074.83 3078.54 3129.10 3158.29 3158.88 3160.87 3166.16 3168.38 3193.19 3194.95 3196.43 3209.80 3213.90 3217.56 3219.19 3229.84 3241.28 3621.74 3637.64
frequency: 18.80 39.28 43.50 56.05 65.85 80.56 87.69 120.09 129.50 152.85 185.23 201.69 219.24 228.73 240.99 261.07 270.44 293.88 301.72 329.98 370.53 379.49 419.03 419.85 440.77 445.89 473.99 504.58 512.30 542.82 574.43 611.01 620.15 635.05 646.47 697.22 721.56 728.72 746.91 761.42 786.28 797.69 817.70 847.97 865.47 880.86 917.30 930.05 954.24 954.87 957.59 971.81 999.46 1009.17 1021.52 1030.68 1046.96 1051.12 1059.61 1067.15 1089.82 1119.03 1120.35 1159.98 1183.26 1185.80 1187.61 1204.04 1215.61 1217.04 1218.08 1267.56 1275.65 1301.79 1317.10 1327.01 1349.44 1363.24 1366.40 1380.20 1395.60 1431.08 1439.86 1460.76 1471.72 1486.75 1487.33 1489.38 1500.33 1502.70 1506.39 1513.32 1514.07 1522.55 1546.59 1572.70 1634.91 1658.47 1674.40 1688.11 1689.79 1700.39 2843.83 3071.15 3074.83 3078.54 3129.10 3158.29 3158.88 3160.87 3166.16 3168.38 3193.19 3194.95 3196.43 3209.80 3213.90 3217.56 3219.19 3229.84 3241.28 3621.74 3637.64
formula: C17H21N2O3
InChI: InChI=1S/C17H21N2O3/c1-12(2)22-17(20)19-18-15-11-14(9-10-16(15)21-3)13-7-5-4-6-8-13/h4-12,18-20H,1-3H3
43 atoms
C  1.514459 3.748958 -0.517639
O  1.311052 2.506851 0.160371
C  0.076961 1.895307 0.066384
C  -0.939967 2.316849 -0.769372
C  -2.12169 1.592739 -0.816273
C  -2.31401 0.451983 -0.04221
C  -1.284877 0.064014 0.811504
C  -0.096911 0.768896 0.870206
N  0.927918 0.356092 1.778254
N  1.787365 -0.646066 1.360119
C  2.744745 -0.50202 0.452865
O  2.990046 0.602258 -0.146128
O  3.441636 -1.546386 0.203794
C  4.576909 -1.507791 -0.763331
C  5.79879 -0.995648 -0.038384
C  4.700333 -2.920565 -1.275401
C  -3.582119 -0.313347 -0.102993
C  -4.192196 -0.573107 -1.327991
C  -5.37731 -1.287928 -1.386795
C  -5.969666 -1.750599 -0.221595
C  -5.371041 -1.49538 1.002901
C  -4.184784 -0.782582 1.061991
H  2.517451 4.073249 -0.256947
H  0.78948 4.483321 -0.16959
H  1.434786 3.618731 -1.597176
H  -0.830232 3.199156 -1.383216
H  -2.920622 1.939466 -1.458723
H  -1.402662 -0.804375 1.447607
H  1.423183 1.103434 2.239313
H  1.679288 -1.556668 1.779194
H  4.274082 -0.828573 -1.55868
H  6.058038 -1.652229 0.791909
H  5.653202 0.016919 0.335743
H  6.639048 -0.976317 -0.731884
H  4.945297 -3.607711 -0.466011
H  5.502055 -2.960118 -2.01206
H  3.780376 -3.249865 -1.755355
H  -3.726257 -0.232365 -2.244845
H  -5.836575 -1.488384 -2.346028
H  -6.896731 -2.306842 -0.26752
H  -5.834145 -1.844262 1.916735
H  -3.73905 -0.565102 2.025335
H  2.34686 1.363838 0.034045
totalener: -995.48066469 hartree
nucrepener: 1748.64029784 hartree
electener: -2744.12096253 hartree
oneelecener: -4805.90077490 hartree
twoeener: 2061.77981237 hartree
kineticenergy: 990.39025357 hartree
xcener: -96.085215935067 hartree
chargesum: 1.0000000
charge: -0.150534 -0.308545 0.268794 -0.142157 -0.162763 0.128332 -0.155892 -0.035542 -0.186079 -0.070428 0.550703 -0.282616 -0.237846 0.087231 -0.235656 -0.196028 0.115517 -0.191897 -0.134191 -0.103326 -0.134475 -0.193001 0.128558 0.136772 0.127943 0.136833 0.144810 0.124682 0.152631 0.200289 0.094723 0.103544 0.095049 0.109062 0.097486 0.099565 0.102137 0.126600 0.136453 0.140226 0.136408 0.127806 0.248825
charge: -0.016433 0.332245 -0.196412 -0.008186 0.036073 -0.049463 0.033744 -0.171537 0.235838 0.305233 -0.433739 0.430781 0.363146 -0.111422 0.023910 0.027056 -0.071171 0.003411 -0.002151 0.000880 -0.002551 0.002556 0.018605 0.020065 0.013103 0.027455 0.037194 0.036226 -0.040249 0.006561 0.025427 0.026298 0.016889 0.034312 0.025747 0.032841 0.022638 0.024250 0.025935 0.026134 0.025824 0.023974 -0.161041
qa: -0.1505 -0.3085 0.2688 -0.1422 -0.1628 0.1283 -0.1559 -0.0355 -0.1861 -0.0704 0.5507 -0.2826 -0.2378 0.0872 -0.2357 -0.1960 0.1155 -0.1919 -0.1342 -0.1033 -0.1345 -0.1930 0.1286 0.1368 0.1279 0.1368 0.1448 0.1247 0.1526 0.2003 0.0947 0.1035 0.0950 0.1091 0.0975 0.0996 0.1021 0.1266 0.1365 0.1402 0.1364 0.1278 0.2488
va: 3.8604 2.1238 3.8514 3.9533 4.0513 3.7197 4.1446 3.9364 3.0410 3.3563 4.2443 2.2591 2.2535 3.8194 3.9214 3.9088 3.5391 3.9996 3.9958 3.9658 3.9937 3.9975 0.9953 0.9871 0.9825 1.0102 1.0059 1.0203 1.0415 1.0020 1.0075 1.0061 1.0121 1.0081 1.0076 1.0079 1.0105 1.0077 1.0012 0.9973 1.0014 1.0074 1.1054
dispcorr: -0.018393155 hartree
energy: -995.502140863245
dipole: 15.96002 -12.46847 3.49155 -2.31910 2.80811 0.48901 -5.68274 5.57635 -0.10639
magnitude: 3.52723 au
magnitude: 8.96551 debye
temp: 298.15 k
press: 1.00 atm
zeropoint: 0.36329612 hartree
thermalvibcorrection: 0.01789926 hartree
thermalrotcorrection: 0.00141627 hartree
thermaltrasncorrection: 0.00141627 hartree
thermaltotal: -995.11811294 hartree
thermalcorr: 0.02073180 hartree
nonthermalcorr: 0.36329612 hartree
totalcorr: 0.38402792 hartree
thermalcorrenthalpy: 0.00094421 hartree
totalenthalpy: -995.11716874 hartree
totalentropycorr: -0.06871008 hartree
gibbsenthalpy: -995.18587881 hartree
gibbsminuselec: 0.31626205 hartree
