program: Orca
programVersion: 5.0.3
elementType: N H C H C C H H O H O H H H
charge: 1
multiplicity: 1
keywords: wB97X-D3 TightOpt Freq def2-TZVPP def2/J RIJCOSX TightSCF defgrid3 CHELPG
frequency: 0.00 0.00 0.00 0.00 0.00 0.00 33.85 198.32 234.50 263.02 343.08 386.91 505.77 605.90 652.19 751.90 812.26 910.06 1000.19 1012.86 1110.57 1139.87 1213.43 1223.83 1326.79 1375.60 1427.81 1463.41 1486.01 1502.39 1517.50 1652.13 1671.94 1847.96 3072.70 3128.30 3157.36 3181.18 3204.14 3506.88 3566.79 3793.75
frequency: 33.85 198.32 234.50 263.02 343.08 386.91 505.77 605.90 652.19 751.90 812.26 910.06 1000.19 1012.86 1110.57 1139.87 1213.43 1223.83 1326.79 1375.60 1427.81 1463.41 1486.01 1502.39 1517.50 1652.13 1671.94 1847.96 3072.70 3128.30 3157.36 3181.18 3204.14 3506.88 3566.79 3793.75
formula: C3H8NO2
InChI: InChI=1S/C3H8NO2/c1-2(4)3(5)6/h2,5H,1,4H3
14 atoms
N  1.387789 -1.073111 0.075182
H  0.663865 -1.736078 -0.267483
C  0.636637 0.192256 0.401609
H  0.708511 0.355555 1.476803
C  1.182521 1.384417 -0.365132
C  -0.816234 -0.141222 0.058007
H  1.105768 1.231608 -1.442906
H  2.222047 1.573299 -0.099001
O  -1.116457 -1.215909 -0.392635
H  1.859043 -1.476098 0.881549
O  -1.626696 0.855751 0.315324
H  -2.536373 0.615585 0.091777
H  2.078138 -0.928202 -0.659373
H  0.604857 2.269435 -0.108309
totalener: -324.15867192 hartree
nucrepener: 260.02897052 hartree
electener: -584.18764244 hartree
oneelecener: -946.30992932 hartree
twoeener: 362.12228687 hartree
kineticenergy: 322.60819635 hartree
xcener: -29.811094912251 hartree
energy: -529.7066 -528.3210 -401.0251 -288.6183 -287.0697 -284.6738 -38.8039 -36.5558 -35.6695 -29.9506 -26.7799 -25.0738 -24.4306 -23.8642 -21.7514 -21.3514 -20.9670 -20.2977 -19.0632 -18.4135 -18.2255 -17.7815 -16.6376 -15.7000 -2.7660 -2.3622 -1.0752 -0.9345 -0.2877 0.2811 0.5004 0.7736 0.9200 1.2431 2.1101 2.2676 3.1585 3.6117 3.7523 4.0054 4.7844 5.0196 5.6925 5.9150 6.6697 6.8683 7.2314 7.6853 8.2213 8.3316 8.6813 8.9569 9.0401 9.3319 9.6644 9.7388 9.8929 10.1490 11.0492 11.7093 11.8534 12.4729 12.5035 12.7310 13.4137 14.6512 15.9709 16.4654 17.5593 17.7344 18.2270 18.8407 19.6267 20.1643 20.6188 21.5080 21.8402 22.2804 22.5978 22.6860 23.7159 24.3458 24.6754 24.9605 25.7382 26.0738 26.2239 26.8579 27.0677 27.7742 28.2984 29.0247 29.1106 30.0679 30.6404 31.1284 31.8784 32.1339 32.3871 33.9312 34.1170 34.9301 35.5526 36.4244 36.8157 36.9893 37.1687 37.2082 38.3701 38.6333 39.2381 39.8732 40.1124 40.6487 41.7449 42.2996 43.0445 45.5730 45.6066 46.0587 46.1884 48.2864 50.1676 50.4700 51.4909 52.4315 53.0377 54.3013 55.1366 56.0345 56.3521 57.7492 59.2648 60.1818 60.9542 61.9664 63.1559 64.0521 65.2009 65.8383 66.7578 68.1263 68.3553 69.6322 70.2369 70.7169 71.7911 72.1775 73.1155 73.8222 74.5259 75.0909 75.2901 75.9119 76.3064 77.2843 77.9304 78.2112 78.5563 79.2003 80.3897 80.9076 81.4271 81.9494 82.1179 82.4334 83.0592 83.8895 83.9120 84.5161 84.7648 84.9028 85.0748 85.6232 86.6182 87.2568 87.4002 88.6217 89.2241 89.6693 90.3311 91.0102 91.2356 91.8337 92.3057 92.8047 93.8119 93.9523 94.7602 95.4932 96.0675 96.4228 97.4385 97.5683 98.8079 99.7628 100.0126 100.5175 101.6928 102.0987 102.6644 102.9451 103.8184 104.1937 104.8462 105.6557 106.2390 106.7277 107.6913 107.9276 108.3832 108.6253 109.8543 110.3761 110.5526 111.2961 111.9250 112.3132 113.0109 113.1949 113.9734 114.9321 115.0092 115.4586 115.9422 116.7703 118.1896 120.0887 121.1267 121.6117 122.5005 122.6160 123.7061 125.0190 126.4387 126.9427 127.8760 128.4386 129.3367 130.9984 131.1117 132.8488 134.4738 135.7028 136.4277 137.3689 137.9944 138.8022 139.8118 140.5004 141.6499 142.2829 143.2667 143.7705 144.8449 145.5684 145.9464 147.0427 147.3799 148.7160 149.5865 151.1272 151.7652 151.9039 152.3924 153.7188 154.6174 157.0715 158.2967 160.4919 161.3571 162.2158 162.6166 165.9423 170.6253 171.3948 172.5982 173.2185 173.7730 174.3180 176.8389 177.6987 177.9961 180.8798 182.4945 184.2731 185.0068 188.0208 192.1510 196.8301 200.7392 203.4173 622.5577 635.7203 642.2483 892.9790 1190.9896 1194.3693 electronvolt
chargesum: 1.0000000
charge: 0.066544 0.216377 -0.021722 0.134821 -0.238282 0.371195 0.112115 0.122219 -0.317342 0.206912 -0.225055 0.248663 0.200423 0.123133
charge: 0.619525 0.030533 -0.050791 0.048965 0.042277 -0.437241 0.030538 0.029274 0.154555 0.055186 0.429078 -0.052174 0.056184 0.044090
qa: 0.0665 0.2164 -0.0217 0.1348 -0.2383 0.3712 0.1121 0.1222 -0.3173 0.2069 -0.2251 0.2487 0.2004 0.1231
va: 3.6607 1.0401 3.9386 1.0054 3.9243 4.1952 0.9982 1.0005 2.1624 0.9917 2.3030 1.0085 0.9950 1.0127
dispcorr: -0.003676769 hartree
energy: -324.163548058087
dipole: 6.73063 -4.78829 1.94234 1.91264 -2.35301 -0.44036 -0.18871 0.51790 0.32919
magnitude: 2.01866 au
magnitude: 5.13102 debye
temp: 298.15 k
press: 1.00 atm
zeropoint: 0.12366147 hartree
thermalvibcorrection: 0.00403116 hartree
thermalrotcorrection: 0.00141627 hartree
thermaltrasncorrection: 0.00141627 hartree
thermaltotal: -324.03302288 hartree
thermalcorr: 0.00686371 hartree
nonthermalcorr: 0.12366147 hartree
totalcorr: 0.13052518 hartree
thermalcorrenthalpy: 0.00094421 hartree
totalenthalpy: -324.03207867 hartree
totalentropycorr: -0.03819099 hartree
gibbsenthalpy: -324.07026967 hartree
gibbsminuselec: 0.09327839 hartree
