program: Orca
programVersion: 5.0.3
elementType: C N C C C C C Cl N C C C N C N H H H H H H H H H H H H
charge: 1
multiplicity: 1
keywords: wB97X-D3 TightOpt Freq def2-TZVPP def2/J RIJCOSX TightSCF defgrid3 CHELPG
frequency: 0.00 0.00 0.00 0.00 0.00 0.00 17.32 35.78 62.17 90.39 99.62 109.04 140.01 170.52 186.26 223.72 266.37 296.21 325.48 359.14 401.92 404.90 447.87 473.16 523.14 556.26 571.68 596.00 643.02 655.85 711.96 746.87 801.38 818.77 853.05 890.65 939.49 955.07 995.26 1049.39 1059.39 1065.41 1067.85 1123.08 1151.74 1167.07 1197.49 1207.96 1249.85 1261.98 1269.92 1337.44 1348.02 1388.65 1410.67 1423.92 1466.95 1473.54 1477.50 1485.62 1487.27 1506.32 1508.83 1551.36 1598.68 1670.87 1676.93 1697.40 2371.84 3062.29 3078.54 3080.80 3138.84 3143.79 3151.84 3184.48 3194.10 3227.98 3245.45 3255.33 3601.94
frequency: 17.32 35.78 62.17 90.39 99.62 109.04 140.01 170.52 186.26 223.72 266.37 296.21 325.48 359.14 401.92 404.90 447.87 473.16 523.14 556.26 571.68 596.00 643.02 655.85 711.96 746.87 801.38 818.77 853.05 890.65 939.49 955.07 995.26 1049.39 1059.39 1065.41 1067.85 1123.08 1151.74 1167.07 1197.49 1207.96 1249.85 1261.98 1269.92 1337.44 1348.02 1388.65 1410.67 1423.92 1466.95 1473.54 1477.50 1485.62 1487.27 1506.32 1508.83 1551.36 1598.68 1670.87 1676.93 1697.40 2371.84 3062.29 3078.54 3080.80 3138.84 3143.79 3151.84 3184.48 3194.10 3227.98 3245.45 3255.33 3601.94
formula: C10H12ClN4
InChI: InChI=1S/C10H12ClN4/c1-8(14-7-12)15(2)6-9-3-4-10(11)13-5-9/h3-5,13H,6H2,1-2H3
27 atoms
C  3.064213 -2.184518 -0.249087
N  2.158172 -1.090709 0.073637
C  1.182984 -1.3171 1.127393
C  -0.212918 -0.88062 0.739405
C  -0.90262 0.101799 1.454778
C  -2.171217 0.50698 1.088037
C  -2.754636 -0.071736 -0.02033
Cl -4.289807 0.338699 -0.594477
N  -2.07869 -1.012041 -0.69666
C  -0.843821 -1.425479 -0.347152
C  2.425437 0.19918 -0.255622
C  3.507259 0.489582 -1.247602
N  1.693102 1.098942 0.322894
C  1.812139 2.384786 -0.00025
N  1.831724 3.515218 -0.228159
H  2.501838 -3.115032 -0.298273
H  3.851588 -2.293638 0.500522
H  3.524897 -2.025918 -1.218828
H  1.470896 -0.786573 2.037336
H  1.177885 -2.383094 1.352734
H  -0.41981 0.572075 2.30185
H  -2.70407 1.273649 1.630731
H  -0.401104 -2.180045 -0.982062
H  4.476041 0.170656 -0.861885
H  3.54965 1.556833 -1.447719
H  3.328656 -0.035734 -2.185819
H  -2.524194 -1.423062 -1.507043
totalener: -1067.28741299 hartree
nucrepener: 1047.74623169 hartree
electener: -2115.03364468 hartree
oneelecener: -3519.53897743 hartree
twoeener: 1404.50533275 hartree
kineticenergy: 1063.45439740 hartree
xcener: -80.287912683687 hartree
chargesum: 1.0000000
charge: -0.182462 -0.167971 -0.038665 0.007971 -0.033126 -0.083998 0.171470 0.091837 -0.049930 0.061090 0.328711 -0.236106 -0.430864 -0.033295 -0.052152 0.098033 0.142549 0.122893 0.132245 0.140427 0.151076 0.166569 0.157605 0.118996 0.120624 0.102391 0.194082
charge: 0.007428 0.258095 -0.019363 -0.059018 0.105133 0.016009 -0.428617 0.559881 0.418457 0.040590 -0.218193 0.049501 0.125991 -0.332528 0.033740 0.016755 0.021778 0.022477 0.041932 0.041619 0.057736 0.049887 0.043252 0.037271 0.040686 0.031054 0.038447
qa: -0.1825 -0.1680 -0.0387 0.0080 -0.0331 -0.0840 0.1715 0.0918 -0.0499 0.0611 0.3287 -0.2361 -0.4309 -0.0333 -0.0522 0.0980 0.1425 0.1229 0.1322 0.1404 0.1511 0.1666 0.1576 0.1190 0.1206 0.1024 0.1941
va: 3.8958 3.1361 3.8357 3.7037 4.0011 3.9541 4.1658 1.4050 3.5704 3.9622 3.8256 3.9631 2.9071 4.2223 3.1095 0.9960 0.9844 0.9940 1.0166 0.9879 1.0090 0.9935 1.0019 0.9958 1.0250 0.9990 1.0037
dispcorr: -0.011911720 hartree
energy: -1067.301798028294
dipole: 23.49769 -24.62582 -1.12813 -10.89708 7.12550 -3.77158 0.23222 -0.43502 -0.20280
magnitude: 3.94191 au
magnitude: 10.01953 debye
temp: 298.15 k
press: 1.00 atm
zeropoint: 0.21753460 hartree
thermalvibcorrection: 0.01186062 hartree
thermalrotcorrection: 0.00141627 hartree
thermaltrasncorrection: 0.00141627 hartree
thermaltotal: -1067.06957026 hartree
thermalcorr: 0.01469317 hartree
nonthermalcorr: 0.21753460 hartree
totalcorr: 0.23222777 hartree
thermalcorrenthalpy: 0.00094421 hartree
totalenthalpy: -1067.06862605 hartree
totalentropycorr: -0.05697283 hartree
gibbsenthalpy: -1067.12559887 hartree
gibbsminuselec: 0.17619915 hartree
