program: Orca
programVersion: 5.0.3
elementType: C C C C C C H C H C C H H N H C H H H H Cl
charge: 1
multiplicity: 1
keywords: wB97X-D3 TightOpt Freq def2-TZVPP def2/J RIJCOSX TightSCF defgrid3 CHELPG
frequency: 0.00 0.00 0.00 0.00 0.00 0.00 51.54 98.79 158.61 180.14 201.49 308.06 324.96 393.14 405.28 479.08 496.83 521.13 540.28 560.67 669.46 695.45 720.15 784.38 822.51 840.46 868.41 890.67 925.10 977.38 1018.60 1044.70 1047.78 1057.08 1067.52 1099.29 1185.03 1194.59 1242.24 1255.86 1294.00 1323.32 1383.37 1426.39 1434.34 1439.84 1471.82 1480.00 1518.62 1530.43 1600.21 1664.21 1681.43 1721.33 3076.74 3152.11 3173.48 3216.03 3221.84 3230.69 3241.18 3244.21 3555.14
frequency: 51.54 98.79 158.61 180.14 201.49 308.06 324.96 393.14 405.28 479.08 496.83 521.13 540.28 560.67 669.46 695.45 720.15 784.38 822.51 840.46 868.41 890.67 925.10 977.38 1018.60 1044.70 1047.78 1057.08 1067.52 1099.29 1185.03 1194.59 1242.24 1255.86 1294.00 1323.32 1383.37 1426.39 1434.34 1439.84 1471.82 1480.00 1518.62 1530.43 1600.21 1664.21 1681.43 1721.33 3076.74 3152.11 3173.48 3216.03 3221.84 3230.69 3241.18 3244.21 3555.14
formula: C10H9ClN
InChI: InChI=1S/C10H9ClN/c1-7-5-6-8-3-2-4-9(11)10(8)12-7/h2-6,12H,1H3
21 atoms
C  2.503914 0.326553 -0.00005
C  1.420366 -0.50871 -0.000017
C  0.1265 0.042876 -0.000017
C  -0.055119 1.4358 -0.000061
C  1.080244 2.272946 -0.000098
C  2.330381 1.722725 -0.00009
H  3.499306 -0.096845 -0.000044
C  -1.383903 1.91924 -0.000075
H  0.944951 3.346399 -0.000132
C  -2.449386 1.063845 -0.000039
C  -2.234208 -0.321048 0.000022
H  -1.549834 2.989828 -0.000121
H  -3.465353 1.431749 -0.000056
N  -0.982625 -0.76065 0.00002
H  -0.810659 -1.760414 0.000049
C  -3.345111 -1.311779 0.000192
H  -3.971807 -1.162532 0.879919
H  -3.973234 -1.161323 -0.878294
H  -2.983227 -2.337996 -0.000788
H  3.205326 2.358044 -0.000115
Cl 1.601161 -2.220219 0.000031
totalener: -901.26491339 hartree
nucrepener: 737.99972795 hartree
electener: -1639.26464134 hartree
oneelecener: -2679.97613205 hartree
twoeener: 1040.71149071 hartree
kineticenergy: 898.21287012 hartree
xcener: -65.182093428261 hartree
chargesum: 1.0000000
charge: -0.029330 -0.040074 0.150945 -0.071538 -0.038054 -0.100913 0.150569 0.029233 0.144414 -0.116705 0.173453 0.151338 0.160955 -0.069629 0.169882 -0.152766 0.125907 0.125863 0.083436 0.160505 -0.007491
charge: 0.023283 -0.383866 -0.093572 -0.055709 0.046609 0.033624 0.043383 0.105181 0.040446 0.025980 -0.053807 0.053161 0.045843 0.446282 0.011792 0.062013 0.047341 0.047326 0.030913 0.041423 0.482356
qa: -0.0293 -0.0401 0.1509 -0.0715 -0.0381 -0.1009 0.1506 0.0292 0.1444 -0.1167 0.1735 0.1513 0.1610 -0.0696 0.1699 -0.1528 0.1259 0.1259 0.0834 0.1605 -0.0075
va: 3.9366 4.0646 3.8056 3.9541 3.9324 3.9711 0.9984 3.9285 1.0057 3.9481 3.8430 1.0024 0.9954 3.5739 1.0460 3.9250 0.9965 0.9965 1.0148 0.9942 1.3220
dispcorr: -0.007342422 hartree
energy: -901.274028158280
dipole: -11.08313 9.43563 -1.64750 6.59642 -5.97552 0.62090 0.00039 -0.00029 0.00010
magnitude: 1.76061 au
magnitude: 4.47512 debye
temp: 298.15 k
press: 1.00 atm
zeropoint: 0.16905686 hartree
thermalvibcorrection: 0.00691659 hartree
thermalrotcorrection: 0.00141627 hartree
thermaltrasncorrection: 0.00141627 hartree
thermaltotal: -901.09522217 hartree
thermalcorr: 0.00974913 hartree
nonthermalcorr: 0.16905686 hartree
totalcorr: 0.17880599 hartree
thermalcorrenthalpy: 0.00094421 hartree
totalenthalpy: -901.09427796 hartree
totalentropycorr: -0.04595942 hartree
gibbsenthalpy: -901.14023738 hartree
gibbsminuselec: 0.13379078 hartree
