program: Orca
programVersion: 5.0.3
elementType: C C C C C C H C C C H N O H H H H C H H H C H H H
charge: 1
multiplicity: 1
keywords: wB97X-D3 TightOpt Freq def2-TZVPP def2/J RIJCOSX TightSCF defgrid3 CHELPG
frequency: 0.00 0.00 0.00 0.00 0.00 0.00 33.30 91.47 103.20 129.04 204.11 208.19 272.29 292.82 310.13 338.16 366.46 426.61 431.49 479.12 534.31 564.30 594.43 598.03 689.21 691.99 745.23 799.93 800.77 824.08 847.13 892.03 929.92 974.38 1015.08 1017.53 1053.49 1066.79 1066.94 1068.22 1140.44 1182.42 1214.30 1237.09 1269.60 1296.54 1302.40 1333.93 1402.63 1426.08 1434.68 1447.98 1453.57 1473.18 1482.02 1492.98 1494.52 1540.21 1544.89 1606.81 1677.68 1693.88 1726.41 3052.53 3077.12 3113.59 3152.57 3171.82 3172.31 3214.52 3215.49 3232.57 3243.28 3584.78 3891.87
frequency: 33.30 91.47 103.20 129.04 204.11 208.19 272.29 292.82 310.13 338.16 366.46 426.61 431.49 479.12 534.31 564.30 594.43 598.03 689.21 691.99 745.23 799.93 800.77 824.08 847.13 892.03 929.92 974.38 1015.08 1017.53 1053.49 1066.79 1066.94 1068.22 1140.44 1182.42 1214.30 1237.09 1269.60 1296.54 1302.40 1333.93 1402.63 1426.08 1434.68 1447.98 1453.57 1473.18 1482.02 1492.98 1494.52 1540.21 1544.89 1606.81 1677.68 1693.88 1726.41 3052.53 3077.12 3113.59 3152.57 3171.82 3172.31 3214.52 3215.49 3232.57 3243.28 3584.78 3891.87
formula: C11H12NO
InChI: InChI=1S/C11H12NO/c1-7-3-5-9-6-4-8(2)12-10(9)11(7)13/h3-6,12-13H,1-2H3
25 atoms
C  2.220533 1.366997 -0.0000
C  1.020383 2.019854 0.0000
C  -0.174363 1.273474 0.0000
C  -0.083142 -0.126129 -0.0000
C  1.158944 -0.780927 -0.000001
C  2.320511 -0.041884 -0.000001
H  -1.574765 2.912481 0.0000
C  -1.470511 1.834151 0.0000
C  -2.456573 -0.354223 -0.000001
C  -2.585487 1.041348 -0.0000
H  -3.577412 1.469862 -0.000001
N  -1.234546 -0.869034 -0.000001
O  1.094024 -2.132225 0.0000
H  1.967541 -2.528084 -0.000006
H  -1.117091 -1.87529 -0.000002
H  0.975764 3.100422 0.000001
H  3.138179 1.941234 -0.0000
C  3.652497 -0.732228 -0.000001
H  3.774643 -1.361871 0.885042
H  3.774636 -1.361885 -0.885035
H  4.466505 -0.011929 -0.000011
C  -3.6277 -1.274275 -0.0000
H  -3.329124 -2.320741 -0.000018
H  -4.244854 -1.087548 0.879148
H  -4.244875 -1.087524 -0.879129
totalener: -556.22273907 hartree
nucrepener: 763.19792206 hartree
electener: -1319.42066113 hartree
oneelecener: -2251.58909919 hartree
twoeener: 932.16843806 hartree
kineticenergy: 553.31246900 hartree
xcener: -54.656545781019 hartree
chargesum: 1.0000000
charge: -0.054981 -0.062137 -0.077048 0.125835 0.158104 -0.000921 0.148110 0.019447 0.167895 -0.114951 0.157790 -0.054860 -0.326390 0.216726 0.173463 0.140082 0.136493 -0.249984 0.114343 0.114340 0.097946 -0.160443 0.082063 0.124539 0.124539
charge: 0.035014 0.028840 -0.061708 -0.063658 -0.176652 -0.060599 0.051438 0.101632 -0.059789 0.019944 0.043506 0.454133 0.368947 -0.095136 0.030508 0.036352 0.039174 0.036404 0.029019 0.029018 0.034394 0.058650 0.029562 0.045504 0.045504
qa: -0.0550 -0.0621 -0.0770 0.1258 0.1581 -0.0009 0.1481 0.0194 0.1679 -0.1150 0.1578 -0.0549 -0.3264 0.2167 0.1735 0.1401 0.1365 -0.2500 0.1143 0.1143 0.0979 -0.1604 0.0821 0.1245 0.1245
va: 3.9487 3.9677 3.9950 3.8759 4.0089 3.7334 1.0032 3.9457 3.8428 3.9278 0.9959 3.5790 2.1648 1.0407 1.0273 1.0078 1.0048 3.9083 0.9918 0.9918 1.0124 3.9254 1.0148 0.9965 0.9965
dispcorr: -0.008618031 hartree
energy: -556.233049384575
dipole: 0.02307 -0.91924 -0.89616 -2.25589 1.87975 -0.37614 -0.00000 0.00000 -0.00000
magnitude: 0.97190 au
magnitude: 2.47038 debye
temp: 298.15 k
press: 1.00 atm
zeropoint: 0.21063226 hartree
thermalvibcorrection: 0.00879033 hartree
thermalrotcorrection: 0.00141627 hartree
thermaltrasncorrection: 0.00141627 hartree
thermaltotal: -556.01079425 hartree
thermalcorr: 0.01162287 hartree
nonthermalcorr: 0.21063226 hartree
totalcorr: 0.22225513 hartree
thermalcorrenthalpy: 0.00094421 hartree
totalenthalpy: -556.00985005 hartree
totalentropycorr: -0.04932434 hartree
gibbsenthalpy: -556.05917438 hartree
gibbsminuselec: 0.17387500 hartree
