program: Orca
programVersion: 5.0.2
elementType: S S P O O O O N C C C C C C C C H H H H H H H H H H H H H H H H H H H
charge: 1
multiplicity: 1
keywords: wB97X-D3 TightOpt Freq def2-TZVPP def2/J RIJCOSX TightSCF defgrid3
frequency: 0.00 0.00 0.00 0.00 0.00 0.00 29.53 32.95 56.86 61.84 66.96 75.58 83.06 94.00 98.80 123.45 129.54 141.27 186.77 193.53 208.41 219.81 227.84 238.47 253.26 260.56 291.14 297.22 299.19 326.95 371.81 413.20 449.40 458.21 482.83 510.19 616.40 653.17 690.04 725.20 734.24 785.69 791.63 801.13 865.90 877.78 961.61 1006.34 1007.03 1044.76 1051.34 1099.22 1100.95 1105.75 1126.42 1151.25 1178.98 1184.74 1185.78 1187.09 1206.08 1209.75 1242.16 1255.07 1263.94 1274.80 1316.61 1344.85 1346.11 1415.42 1437.74 1463.98 1475.57 1477.45 1486.84 1487.81 1493.45 1496.37 1501.75 1502.48 1505.00 1505.25 1506.61 1512.06 1624.52 1789.61 3066.31 3073.43 3077.43 3086.35 3094.25 3097.07 3116.26 3126.23 3144.87 3145.67 3158.30 3166.01 3175.21 3175.62 3176.21 3193.44 3202.17 3203.89 3827.15
frequency: 29.53 32.95 56.86 61.84 66.96 75.58 83.06 94.00 98.80 123.45 129.54 141.27 186.77 193.53 208.41 219.81 227.84 238.47 253.26 260.56 291.14 297.22 299.19 326.95 371.81 413.20 449.40 458.21 482.83 510.19 616.40 653.17 690.04 725.20 734.24 785.69 791.63 801.13 865.90 877.78 961.61 1006.34 1007.03 1044.76 1051.34 1099.22 1100.95 1105.75 1126.42 1151.25 1178.98 1184.74 1185.78 1187.09 1206.08 1209.75 1242.16 1255.07 1263.94 1274.80 1316.61 1344.85 1346.11 1415.42 1437.74 1463.98 1475.57 1477.45 1486.84 1487.81 1493.45 1496.37 1501.75 1502.48 1505.00 1505.25 1506.61 1512.06 1624.52 1789.61 3066.31 3073.43 3077.43 3086.35 3094.25 3097.07 3116.26 3126.23 3144.87 3145.67 3158.30 3166.01 3175.21 3175.62 3176.21 3193.44 3202.17 3203.89 3827.15
formula: C8H19NO4PS2
InChI: InChI=1S/C8H19NO4PS2/c1-7(8(10)9-2)15-5-6-16-14(11,12-3)13-4/h7,9-10H,5-6H2,1-4H3
35 atoms
S  -2.606608 -1.536955 0.490417
S  1.792597 -2.017354 0.165458
P  1.888287 -0.018407 -0.334678
O  3.327981 0.059227 -0.939038
O  1.886966 0.867456 0.980833
O  -3.389166 1.610408 0.680778
O  0.773238 0.456801 -1.182525
N  -1.307841 1.769769 -0.066251
C  -2.558526 -0.19962 -0.743066
C  -0.86715 -1.602848 0.979909
C  0.005665 -2.262479 -0.081679
C  -3.827258 -0.24626 -1.592194
C  -2.40988 1.107036 -0.02296
C  -1.068023 3.019372 0.644984
C  3.849092 1.285201 -1.488808
C  2.827257 0.65834 2.0461
H  -1.682779 -0.325737 -1.37851
H  -0.847499 -2.169986 1.910071
H  -0.522704 -0.597013 1.220705
H  -0.23368 -1.911385 -1.08194
H  -0.126441 -3.343408 -0.072587
H  -4.735979 -0.233825 -0.986803
H  -3.861414 0.595032 -2.283863
H  -3.836994 -1.169014 -2.167601
H  -0.517406 1.343809 -0.589372
H  0.006404 3.164166 0.70186
H  -1.486507 2.9690 1.647213
H  -1.521962 3.851301 0.109174
H  4.852517 1.058052 -1.832873
H  3.229249 1.606679 -2.323315
H  3.884258 2.059448 -0.722712
H  2.646178 1.442031 2.775011
H  2.665052 -0.318182 2.501568
H  3.848924 0.727882 1.674414
H  -4.131002 0.998373 0.745055
totalener: -1809.69731233 hartree
nucrepener: 1739.15265585 hartree
electener: -3548.84996818 hartree
oneelecener: -5929.73094068 hartree
twoeener: 2380.88097250 hartree
kineticenergy: 1804.75701883 hartree
xcener: -118.612035627628 hartree
chargesum: 1.0000000
charge: -0.047969 -0.102789 0.824462 -0.312957 -0.332058 -0.222420 -0.576710 -0.164572 -0.069408 -0.165390 -0.118690 -0.230996 0.355084 -0.140730 -0.145027 -0.123654 0.096980 0.149746 0.087964 0.127550 0.150944 0.090231 0.122293 0.126152 0.244981 0.114600 0.124950 0.140728 0.142890 0.133125 0.112611 0.125917 0.118338 0.126741 0.237082
charge: 0.640992 0.472403 0.031362 0.105223 0.081803 0.454647 -0.198098 0.399676 -0.298831 -0.268262 -0.271867 0.012190 -0.246175 0.036984 -0.031557 -0.054343 0.025065 0.018585 -0.003862 0.001113 0.017415 0.015841 0.028536 0.033424 -0.067488 0.022890 0.024539 0.027016 0.019778 0.011128 0.004085 0.014359 0.002044 0.006855 -0.067469
qa: -0.0480 -0.1028 0.8245 -0.3130 -0.3321 -0.2224 -0.5767 -0.1646 -0.0694 -0.1654 -0.1187 -0.2310 0.3551 -0.1407 -0.1450 -0.1237 0.0970 0.1497 0.0880 0.1275 0.1509 0.0902 0.1223 0.1262 0.2450 0.1146 0.1250 0.1407 0.1429 0.1331 0.1126 0.1259 0.1183 0.1267 0.2371
va: 2.2728 2.3198 5.4760 2.1761 2.0734 2.3190 2.0375 3.4092 4.0373 3.9680 3.8388 3.9069 3.9408 3.8535 3.8562 3.8507 1.0278 1.0084 1.0394 1.0242 1.0045 1.0137 1.0009 1.0078 1.0511 1.0073 0.9978 0.9933 0.9882 0.9908 0.9863 0.9890 1.0002 0.9879 1.0257
dispcorr: -0.018733203 hartree
energy: -1809.715997420592
dipole: -4.12965 3.04388 -1.08577 9.95734 -8.42878 1.52856 0.17944 0.23337 0.41281
magnitude: 1.91984 au
magnitude: 4.87985 debye
temp: 298.15 k
press: 1.00 atm
zeropoint: 0.28946908 hartree
thermalvibcorrection: 0.01824932 hartree
thermalrotcorrection: 0.00141627 hartree
thermaltrasncorrection: 0.00141627 hartree
thermaltotal: -1809.40544648 hartree
thermalcorr: 0.02108186 hartree
nonthermalcorr: 0.28946908 hartree
totalcorr: 0.31055094 hartree
thermalcorrenthalpy: 0.00094421 hartree
totalenthalpy: -1809.40450227 hartree
totalentropycorr: -0.06959487 hartree
gibbsenthalpy: -1809.47409714 hartree
gibbsminuselec: 0.24190029 hartree
