program: Orca
programVersion: 5.0.2
elementType: S S P O O O O N C C C C C C C C H H H H H H H H H H H H H H H H H H H
charge: 1
multiplicity: 1
keywords: wB97X-D3 TightOpt Freq def2-TZVPP def2/J RIJCOSX TightSCF defgrid3
frequency: 0.00 0.00 0.00 0.00 0.00 0.00 26.56 37.32 45.76 72.44 81.76 92.09 95.19 108.34 115.93 122.28 126.97 151.47 163.20 180.02 186.86 195.12 216.04 222.31 228.84 232.73 260.23 279.46 298.74 305.70 330.12 369.35 382.92 421.31 456.41 498.97 513.09 603.58 606.39 685.51 701.05 729.86 787.87 804.85 808.81 853.52 887.11 960.37 966.55 1000.30 1042.92 1055.63 1060.80 1118.43 1121.74 1127.10 1150.24 1161.79 1173.98 1185.20 1195.91 1198.78 1222.75 1224.22 1246.01 1261.05 1319.70 1327.40 1336.15 1340.70 1430.40 1463.29 1467.61 1469.45 1477.12 1489.59 1494.49 1496.85 1497.92 1509.49 1513.16 1515.93 1520.10 1524.87 1600.33 1725.99 3063.92 3068.45 3075.58 3092.06 3100.64 3109.26 3123.16 3136.21 3140.17 3160.49 3164.53 3176.33 3183.15 3194.80 3201.73 3208.97 3214.22 3700.70 3876.77
frequency: 26.56 37.32 45.76 72.44 81.76 92.09 95.19 108.34 115.93 122.28 126.97 151.47 163.20 180.02 186.86 195.12 216.04 222.31 228.84 232.73 260.23 279.46 298.74 305.70 330.12 369.35 382.92 421.31 456.41 498.97 513.09 603.58 606.39 685.51 701.05 729.86 787.87 804.85 808.81 853.52 887.11 960.37 966.55 1000.30 1042.92 1055.63 1060.80 1118.43 1121.74 1127.10 1150.24 1161.79 1173.98 1185.20 1195.91 1198.78 1222.75 1224.22 1246.01 1261.05 1319.70 1327.40 1336.15 1340.70 1430.40 1463.29 1467.61 1469.45 1477.12 1489.59 1494.49 1496.85 1497.92 1509.49 1513.16 1515.93 1520.10 1524.87 1600.33 1725.99 3063.92 3068.45 3075.58 3092.06 3100.64 3109.26 3123.16 3136.21 3140.17 3160.49 3164.53 3176.33 3183.15 3194.80 3201.73 3208.97 3214.22 3700.70 3876.77
formula: C8H19NO4PS2
InChI: InChI=1S/C8H19NO4PS2/c1-7(8(10)9-2)15-5-6-16-14(11,12-3)13-4/h7,9,11H,5-6H2,1-4H3
35 atoms
S  2.542184 -1.756838 -0.425126
S  -1.88536 -1.683693 -0.88189
P  -2.556413 0.016773 -0.028588
O  -1.820004 1.192845 -0.688831
O  -2.5238 0.093901 1.519825
O  0.960494 1.032947 0.640193
O  -4.079923 0.115642 -0.349434
N  2.761127 1.736234 -0.501238
C  2.889152 -0.380307 0.718075
C  0.786634 -2.073062 -0.137916
C  -0.092981 -1.355006 -1.148883
C  4.403254 -0.233445 0.809872
C  2.128743 0.864274 0.288859
C  2.106804 2.917432 -1.022982
C  -1.756049 2.541932 -0.14828
C  -1.415932 -0.269662 2.38597
H  2.48844 -0.654786 1.693831
H  0.543722 -1.775557 0.88008
H  0.652175 -3.152263 -0.208005
H  0.087414 -1.718555 -2.158973
H  0.06047 -0.280916 -1.135123
H  4.867918 -0.106099 -0.170227
H  4.668249 0.619058 1.435134
H  4.836688 -1.128421 1.251885
H  3.708179 1.547399 -0.772589
H  2.822502 3.485598 -1.610456
H  1.742131 3.543751 -0.209376
H  1.264444 2.645153 -1.660365
H  -1.719337 3.202243 -1.008009
H  -2.639736 2.755394 0.449079
H  -0.84564 2.609787 0.440417
H  -1.677671 0.116436 3.365055
H  -1.347326 -1.355239 2.418569
H  -0.494418 0.181265 2.020509
H  -4.691605 -0.051841 0.3735
totalener: -1809.67285773 hartree
nucrepener: 1734.13127417 hartree
electener: -3543.80413190 hartree
oneelecener: -5919.54504538 hartree
twoeener: 2375.74091348 hartree
kineticenergy: 1804.75156850 hartree
xcener: -118.609089826890 hartree
chargesum: 1.0000000
charge: -0.065435 -0.042512 0.796882 -0.249031 -0.287621 -0.536366 -0.276808 -0.174017 -0.031456 -0.138190 -0.145885 -0.294183 0.356687 -0.167974 -0.136474 -0.155097 0.100913 0.085237 0.148488 0.156096 0.131828 0.086625 0.125777 0.122747 0.165154 0.123407 0.112122 0.103209 0.143716 0.137515 0.140125 0.149963 0.132925 0.145673 0.235962
charge: 0.630793 0.520581 0.128574 0.138880 0.117731 0.039415 0.229996 0.335054 -0.291301 -0.275676 -0.241478 -0.009639 -0.410907 0.000914 -0.002798 -0.012320 0.020011 0.001624 0.012238 0.016149 -0.001038 0.013167 0.023287 0.027245 -0.020656 0.020425 0.016104 0.011763 0.019642 0.008367 0.006903 0.020238 0.007312 -0.004928 -0.095675
qa: -0.0654 -0.0425 0.7969 -0.2490 -0.2876 -0.5364 -0.2768 -0.1740 -0.0315 -0.1382 -0.1459 -0.2942 0.3567 -0.1680 -0.1365 -0.1551 0.1009 0.0852 0.1485 0.1561 0.1318 0.0866 0.1258 0.1227 0.1652 0.1234 0.1121 0.1032 0.1437 0.1375 0.1401 0.1500 0.1329 0.1457 0.2360
va: 2.2542 2.4050 5.4530 2.1948 2.1499 1.9630 2.3231 3.2396 3.9432 3.9523 3.8720 3.9306 4.0297 3.9061 3.7888 3.7810 1.0168 1.0372 1.0049 1.0074 1.0304 1.0083 0.9982 1.0101 1.0196 1.0045 0.9907 0.9879 0.9870 0.9952 0.9970 0.9953 0.9868 1.0021 1.0289
dispcorr: -0.019400172 hartree
energy: -1809.692432269687
dipole: 16.53417 -17.32744 -0.79327 10.65582 -9.65632 0.99949 5.45986 -4.73374 0.72613
magnitude: 1.46817 au
magnitude: 3.73178 debye
temp: 298.15 k
press: 1.00 atm
zeropoint: 0.28766775 hartree
thermalvibcorrection: 0.01889733 hartree
thermalrotcorrection: 0.00141627 hartree
thermaltrasncorrection: 0.00141627 hartree
thermaltotal: -1809.38303465 hartree
thermalcorr: 0.02172987 hartree
nonthermalcorr: 0.28766775 hartree
totalcorr: 0.30939762 hartree
thermalcorrenthalpy: 0.00094421 hartree
totalenthalpy: -1809.38209044 hartree
totalentropycorr: -0.07089338 hartree
gibbsenthalpy: -1809.45298382 hartree
gibbsminuselec: 0.23944845 hartree
