program: Orca
programVersion: 5.0.2
elementType: Cl Cl Cl S O N N C C C C C C C C C C C C C C H H H H H H H H H H
charge: 1
multiplicity: 1
keywords: wB97X-D3 TightOpt Freq def2-TZVPP def2/J RIJCOSX TightSCF defgrid3
frequency: 0.00 0.00 0.00 0.00 0.00 0.00 21.09 25.55 38.28 44.73 79.07 90.60 113.99 133.19 168.93 196.43 210.03 217.26 228.02 232.51 277.88 280.65 327.98 349.42 372.82 386.72 417.65 439.02 447.74 474.68 533.18 537.83 547.69 549.73 562.97 615.29 616.62 683.19 694.90 713.69 730.54 740.17 753.31 757.43 767.26 806.33 843.60 873.46 898.04 908.44 947.50 953.26 986.79 1000.38 1020.29 1030.06 1075.47 1087.59 1140.30 1187.56 1192.36 1220.94 1229.83 1249.81 1264.14 1295.55 1300.11 1341.99 1355.66 1378.80 1389.31 1478.99 1480.78 1486.24 1499.61 1505.38 1528.00 1546.93 1579.27 1653.89 1664.84 1695.78 1713.80 3077.37 3179.14 3182.41 3221.43 3233.12 3237.68 3241.46 3241.58 3674.97 3692.45
frequency: 21.09 25.55 38.28 44.73 79.07 90.60 113.99 133.19 168.93 196.43 210.03 217.26 228.02 232.51 277.88 280.65 327.98 349.42 372.82 386.72 417.65 439.02 447.74 474.68 533.18 537.83 547.69 549.73 562.97 615.29 616.62 683.19 694.90 713.69 730.54 740.17 753.31 757.43 767.26 806.33 843.60 873.46 898.04 908.44 947.50 953.26 986.79 1000.38 1020.29 1030.06 1075.47 1087.59 1140.30 1187.56 1192.36 1220.94 1229.83 1249.81 1264.14 1295.55 1300.11 1341.99 1355.66 1378.80 1389.31 1478.99 1480.78 1486.24 1499.61 1505.38 1528.00 1546.93 1579.27 1653.89 1664.84 1695.78 1713.80 3077.37 3179.14 3182.41 3221.43 3233.12 3237.68 3241.46 3241.58 3674.97 3692.45
formula: C14H10Cl3N2OS
InChI: InChI=1S/C14H10Cl3N2OS/c1-21-14-18-9-5-8(16)12(6-10(9)19-14)20-11-4-2-3-7(15)13(11)17/h2-6,18-19H,1H3
31 atoms
Cl 0.195294 3.935241 -0.270858
Cl 2.148683 -0.016781 -1.826755
Cl 4.204819 -2.359343 -1.253631
S  -5.368258 -1.565687 -0.112856
O  1.46375 1.539391 0.584123
N  -3.844067 0.644229 -0.312086
N  -2.693179 -1.06601 0.342286
C  -2.535227 1.096647 -0.140065
C  -1.79829 0.002947 0.278929
C  0.15686 1.313374 0.36391
C  -0.442329 0.07938 0.546471
C  -1.949443 2.340021 -0.31748
C  -0.598973 2.434409 -0.062273
C  -3.913076 -0.655291 -0.017691
C  2.313386 0.477075 0.817281
C  2.739922 -0.319254 -0.244275
C  2.782998 0.279458 2.100186
C  3.648771 -1.343317 0.014655
C  3.692337 -0.738022 2.339196
C  4.121045 -1.547986 1.303645
C  -4.80014 -3.199426 0.379872
H  0.135253 -0.775066 0.869231
H  -2.504814 3.207123 -0.645231
H  -4.628256 1.197161 -0.615926
H  2.44176 0.935366 2.889407
H  4.074198 -0.89734 3.33826
H  4.832621 -2.342491 1.479227
H  -4.432685 -3.200177 1.40417
H  -4.06699 -3.592897 -0.321431
H  -5.688553 -3.826025 0.334509
H  -2.465451 -2.007687 0.609625
totalener: -2502.90761907 hartree
nucrepener: 2146.90742058 hartree
electener: -4649.81503965 hartree
oneelecener: -7688.82777181 hartree
twoeener: 3039.01273216 hartree
kineticenergy: 2497.19647736 hartree
xcener: -152.644191660262 hartree
chargesum: 1.0000000
charge: 0.016163 -0.013488 -0.014255 0.090164 -0.268580 -0.104188 -0.142815 0.030226 0.094665 0.182517 -0.105898 -0.075629 0.030881 0.268527 0.179768 -0.003020 -0.138620 0.009995 -0.125631 -0.099909 -0.280117 0.133968 0.135125 0.177394 0.143926 0.147123 0.136921 0.133176 0.134771 0.149659 0.177183
charge: 0.488805 0.469842 0.453894 0.718117 0.360386 0.401255 0.402456 -0.122344 -0.114276 -0.221090 0.007497 -0.005667 -0.381624 -0.427225 -0.223387 -0.431191 0.001431 -0.424967 0.006441 -0.021513 -0.163783 0.033775 0.036452 0.017866 0.034418 0.032745 0.032163 0.003835 0.004323 0.023255 0.008110
qa: 0.0162 -0.0135 -0.0143 0.0902 -0.2686 -0.1042 -0.1428 0.0302 0.0947 0.1825 -0.1059 -0.0756 0.0309 0.2685 0.1798 -0.0030 -0.1386 0.0100 -0.1256 -0.0999 -0.2801 0.1340 0.1351 0.1774 0.1439 0.1471 0.1369 0.1332 0.1348 0.1497 0.1772
va: 1.3301 1.3181 1.3029 2.4528 2.1624 3.5026 3.5219 3.9292 3.9199 3.9645 4.0269 4.0751 4.1118 4.0624 3.7532 4.0266 4.0061 4.0296 3.9782 3.9692 3.9577 1.0143 1.0207 1.0134 1.0053 0.9960 1.0083 0.9956 0.9954 1.0046 1.0141
dispcorr: -0.015357562 hartree
energy: -2502.922996302735
dipole: -20.49633 15.16142 -5.33492 -12.85353 10.89916 -1.95436 13.49428 -12.24000 1.25429
magnitude: 5.81843 au
magnitude: 14.78928 debye
temp: 298.15 k
press: 1.00 atm
zeropoint: 0.21909305 hartree
thermalvibcorrection: 0.01595074 hartree
thermalrotcorrection: 0.00141627 hartree
thermaltrasncorrection: 0.00141627 hartree
thermaltotal: -2502.68511997 hartree
thermalcorr: 0.01878328 hartree
nonthermalcorr: 0.21909305 hartree
totalcorr: 0.23787633 hartree
thermalcorrenthalpy: 0.00094421 hartree
totalenthalpy: -2502.68417577 hartree
totalentropycorr: -0.06600369 hartree
gibbsenthalpy: -2502.75017945 hartree
gibbsminuselec: 0.17281685 hartree
