program: Orca
programVersion: 5.0.2
elementType: S S S P P O O O O O O C C C C C C C C C C C C C C C C H H H H H H H H H H H H H H H H H H H H H
charge: 1
multiplicity: 1
keywords: wB97X-D3 TightOpt Freq def2-TZVPP def2/J RIJCOSX TightSCF defgrid3
frequency: 0.00 0.00 0.00 0.00 0.00 0.00 7.31 10.93 12.23 23.29 29.50 40.95 43.97 56.72 58.90 64.52 65.86 69.80 91.45 94.30 110.03 112.06 120.79 124.36 133.90 148.54 167.00 175.06 201.96 203.56 213.17 227.09 253.88 276.47 281.16 301.38 316.18 321.28 355.80 376.06 379.28 417.47 426.26 432.93 436.57 444.97 460.51 467.90 481.91 491.24 529.45 570.39 573.75 610.42 650.97 653.86 669.13 684.05 731.66 761.07 789.99 814.67 822.85 835.15 848.39 859.77 865.36 868.54 873.57 893.90 911.46 962.81 989.02 1003.76 1011.00 1019.47 1036.38 1045.96 1062.25 1109.37 1112.12 1127.15 1131.47 1132.33 1132.99 1143.02 1146.56 1181.43 1184.67 1190.01 1190.84 1191.66 1197.73 1207.23 1210.30 1214.12 1215.76 1225.24 1281.49 1307.32 1310.98 1327.95 1340.00 1454.80 1455.25 1484.41 1485.38 1489.09 1493.32 1495.42 1498.92 1502.01 1502.81 1503.96 1505.87 1507.73 1509.36 1539.60 1549.81 1658.14 1663.86 1668.88 1678.60 2730.87 3069.85 3070.90 3090.06 3094.68 3153.85 3155.21 3186.94 3187.09 3188.01 3194.36 3210.20 3215.98 3216.92 3217.47 3220.06 3221.96 3233.15 3234.05 3235.65 3236.63
frequency: 7.31 10.93 12.23 23.29 29.50 40.95 43.97 56.72 58.90 64.52 65.86 69.80 91.45 94.30 110.03 112.06 120.79 124.36 133.90 148.54 167.00 175.06 201.96 203.56 213.17 227.09 253.88 276.47 281.16 301.38 316.18 321.28 355.80 376.06 379.28 417.47 426.26 432.93 436.57 444.97 460.51 467.90 481.91 491.24 529.45 570.39 573.75 610.42 650.97 653.86 669.13 684.05 731.66 761.07 789.99 814.67 822.85 835.15 848.39 859.77 865.36 868.54 873.57 893.90 911.46 962.81 989.02 1003.76 1011.00 1019.47 1036.38 1045.96 1062.25 1109.37 1112.12 1127.15 1131.47 1132.33 1132.99 1143.02 1146.56 1181.43 1184.67 1190.01 1190.84 1191.66 1197.73 1207.23 1210.30 1214.12 1215.76 1225.24 1281.49 1307.32 1310.98 1327.95 1340.00 1454.80 1455.25 1484.41 1485.38 1489.09 1493.32 1495.42 1498.92 1502.01 1502.81 1503.96 1505.87 1507.73 1509.36 1539.60 1549.81 1658.14 1663.86 1668.88 1678.60 2730.87 3069.85 3070.90 3090.06 3094.68 3153.85 3155.21 3186.94 3187.09 3188.01 3194.36 3210.20 3215.98 3216.92 3217.47 3220.06 3221.96 3233.15 3234.05 3235.65 3236.63
formula: C16H21O6P2S3
InChI: InChI=1S/C16H21O6P2S3/c1-17-23(25,18-2)21-13-5-9-15(10-6-13)27-16-11-7-14(8-12-16)22-24(26,19-3)20-4/h5-12,25H,1-4H3
48 atoms
S  -0.054185 3.645025 -0.175999
S  4.223307 -1.855252 -1.725631
S  -3.387567 -2.087142 -0.226786
P  5.066868 -1.060131 -0.060503
P  -4.983496 -1.096451 0.125709
O  4.076556 -0.464744 0.962885
O  -4.983765 0.415306 -0.404517
O  5.985637 0.098596 -0.509596
O  5.821715 -2.186422 0.672284
O  -6.322511 -1.641817 -0.491683
O  -5.383035 -0.883332 1.633934
C  1.116539 2.368405 0.149234
C  -1.573574 2.743588 -0.252383
C  3.079601 0.509747 0.656901
C  -3.857955 1.20769 -0.344339
C  0.791846 1.018857 0.26854
C  -2.015513 2.227815 -1.465868
C  2.44746 2.765273 0.297282
C  -2.311513 2.525878 0.90596
C  1.77825 0.081359 0.526808
C  -3.160922 1.453689 -1.514278
C  3.439555 1.837733 0.554748
C  -3.460676 1.75592 0.863829
C  7.095307 -0.02897 -1.437395
C  6.346743 -2.068189 2.026652
C  -6.403794 -2.10327 -1.842795
C  -5.478777 -1.991301 2.535107
H  -0.231751 0.685979 0.166258
H  -1.447907 2.415981 -2.367683
H  2.708599 3.812979 0.217757
H  -1.974956 2.947864 1.8438
H  1.526223 -0.965236 0.634967
H  -3.508227 1.020861 -2.442141
H  4.468112 2.14591 0.682854
H  -4.041045 1.562752 1.755577
H  7.669804 0.884605 -1.332743
H  6.709847 -0.118704 -2.450085
H  7.702015 -0.893303 -1.175482
H  7.018739 -1.214824 2.085461
H  5.518853 -1.95984 2.721692
H  6.886033 -2.990935 2.207395
H  -6.301306 -1.263554 -2.530047
H  -5.627929 -2.843347 -2.036078
H  -7.386866 -2.550653 -1.954448
H  -6.311769 -2.63294 2.249833
H  -4.54921 -2.56017 2.532809
H  -5.659244 -1.570095 3.519582
H  3.798994 -2.946902 -1.070468
totalener: -2951.06293286 hartree
nucrepener: 3360.86048771 hartree
electener: -6311.92342056 hartree
twoeener: 4414.74257685 hartree
kineticenergy: 2943.20092612 hartree
xcener: -192.869419197933 hartree
chargesum: 1.0000000
charge: 0.010932 -0.033409 -0.426759 0.794255 0.738054 -0.288930 -0.326375 -0.271082 -0.280721 -0.306787 -0.313376 0.049821 0.012731 0.210375 0.210082 -0.092991 -0.111273 -0.102562 -0.121695 -0.208637 -0.120902 -0.165136 -0.110615 -0.123937 -0.125402 -0.125106 -0.124458 0.128307 0.126513 0.124879 0.129631 0.133511 0.124210 0.132438 0.144475 0.144412 0.136807 0.135370 0.131678 0.143900 0.147352 0.115114 0.113487 0.126966 0.122940 0.108535 0.120338 0.163038
charge: 0.696021 0.464463 -0.080474 0.115676 -0.009312 0.179583 0.165746 0.134905 0.123836 0.111816 0.105739 -0.299746 -0.337959 -0.209932 -0.218949 -0.003445 -0.022088 -0.017332 -0.020625 -0.008178 0.003569 -0.013671 0.002690 -0.006286 0.006413 -0.058786 -0.058415 0.031797 0.027442 0.029580 0.028503 0.030657 0.030812 0.027903 0.030709 0.024481 0.013025 0.012325 0.012192 0.015248 0.023521 0.003944 -0.000677 0.012304 0.006671 -0.000694 0.010710 -0.115711
qa: 0.0109 -0.0334 -0.4268 0.7943 0.7381 -0.2889 -0.3264 -0.2711 -0.2807 -0.3068 -0.3134 0.0498 0.0127 0.2104 0.2101 -0.0930 -0.1113 -0.1026 -0.1217 -0.2086 -0.1209 -0.1651 -0.1106 -0.1239 -0.1254 -0.1251 -0.1245 0.1283 0.1265 0.1249 0.1296 0.1335 0.1242 0.1324 0.1445 0.1444 0.1368 0.1354 0.1317 0.1439 0.1474 0.1151 0.1135 0.1270 0.1229 0.1085 0.1203 0.1630
va: 2.4065 2.3495 2.0174 5.4898 5.5562 2.2285 2.1383 2.2223 2.2194 2.1458 2.1410 3.9514 3.8260 3.6335 3.8622 3.9449 3.9722 3.9729 3.9826 4.1370 4.0423 4.1030 4.0153 3.8203 3.8085 3.8584 3.8593 1.0225 1.0112 1.0115 1.0104 1.0061 1.0090 1.0107 1.0110 0.9883 0.9861 0.9834 0.9875 0.9892 0.9861 0.9878 1.0014 0.9912 0.9899 1.0016 0.9902 1.0112
dispcorr: -0.024432660 hartree
energy: -2951.087338511598
dipole: 6.59041 0.68906 7.27946 -7.05990 5.07316 -1.98674 3.47015 -3.46728 0.00286
magnitude: 7.54571 au
magnitude: 19.17967 debye
temp: 298.15 k
press: 1.00 atm
zeropoint: 0.36291296 hartree
thermalvibcorrection: 0.02817733 hartree
thermalrotcorrection: 0.00141627 hartree
thermaltrasncorrection: 0.00141627 hartree
thermaltotal: -2950.69341568 hartree
thermalcorr: 0.03100987 hartree
nonthermalcorr: 0.36291296 hartree
totalcorr: 0.39392283 hartree
thermalcorrenthalpy: 0.00094421 hartree
totalenthalpy: -2950.69247147 hartree
totalentropycorr: -0.09235208 hartree
gibbsenthalpy: -2950.78482356 hartree
gibbsminuselec: 0.30251496 hartree
