program: Orca
programVersion: 5.0.2
elementType: Cl Cl S F F O O O N N N N C C C C C C C C C C C H H H H H H H H H H H
charge: 1
multiplicity: 1
keywords: wB97X-D3 TightOpt Freq def2-TZVPP def2/J RIJCOSX TightSCF defgrid3 CHELPG
frequency: 0.00 0.00 0.00 0.00 0.00 0.00 11.42 22.31 35.05 42.53 43.57 51.10 67.65 102.90 119.52 122.69 171.24 178.89 180.58 188.41 198.36 218.11 231.82 248.91 277.52 289.45 298.63 324.59 348.73 363.64 391.58 418.28 466.31 476.29 481.94 496.27 524.13 530.40 535.85 549.44 585.38 596.13 607.70 656.62 681.56 689.16 729.71 762.56 774.05 785.64 804.54 820.45 857.48 874.04 931.65 945.85 984.81 991.86 1002.46 1030.98 1068.39 1104.70 1135.20 1155.71 1169.79 1174.03 1219.74 1257.04 1270.06 1276.20 1283.70 1304.18 1326.32 1370.97 1391.03 1393.21 1406.99 1427.13 1430.03 1452.89 1455.79 1466.64 1473.61 1480.60 1497.59 1549.03 1588.76 1637.50 1682.06 1695.95 1926.74 3085.74 3086.19 3161.26 3165.10 3190.06 3190.60 3198.47 3241.93 3244.86 3620.30 3629.39
frequency: 11.42 22.31 35.05 42.53 43.57 51.10 67.65 102.90 119.52 122.69 171.24 178.89 180.58 188.41 198.36 218.11 231.82 248.91 277.52 289.45 298.63 324.59 348.73 363.64 391.58 418.28 466.31 476.29 481.94 496.27 524.13 530.40 535.85 549.44 585.38 596.13 607.70 656.62 681.56 689.16 729.71 762.56 774.05 785.64 804.54 820.45 857.48 874.04 931.65 945.85 984.81 991.86 1002.46 1030.98 1068.39 1104.70 1135.20 1155.71 1169.79 1174.03 1219.74 1257.04 1270.06 1276.20 1283.70 1304.18 1326.32 1370.97 1391.03 1393.21 1406.99 1427.13 1430.03 1452.89 1455.79 1466.64 1473.61 1480.60 1497.59 1549.03 1588.76 1637.50 1682.06 1695.95 1926.74 3085.74 3086.19 3161.26 3165.10 3190.06 3190.60 3198.47 3241.93 3244.86 3620.30 3629.39
formula: C11H11Cl2F2N4O3S
InChI: InChI=1S/C11H11Cl2F2N4O3S/c1-5-16-19(11(20)18(5)10(14)15)9-4-8(17-23(2,21)22)6(12)3-7(9)13/h3-4,10,16-17H,1-2H3
34 atoms
Cl -1.099516 3.205163 0.560899
Cl 4.09476 2.226458 -0.30878
S  3.431879 -1.934292 0.13941
F  -5.764079 -0.092325 -0.001315
F  -5.151623 -1.519649 -1.514657
O  -2.691538 1.423939 -1.819319
O  2.131518 -2.337162 0.58295
O  4.284163 -2.807117 -0.584641
N  -1.467103 0.300807 -0.188259
N  -3.554555 -0.290936 -0.471556
N  -1.797931 -0.741432 0.641668
N  3.195554 -0.614504 -0.845688
C  -0.139389 0.802276 -0.247111
C  -2.563881 0.616956 -0.957918
C  -3.044239 -1.095495 0.474373
C  2.195469 0.328377 -0.578121
C  0.868251 -0.073308 -0.599999
C  0.14117 2.128642 0.071584
C  2.469233 1.669903 -0.298201
C  1.452814 2.563761 0.003665
C  -4.903489 -0.309024 -1.001999
C  -3.734153 -2.179981 1.200541
C  4.311202 -1.314175 1.537834
H  0.639318 -1.090535 -0.882738
H  4.04797 -0.275887 -1.268088
H  1.690513 3.593908 0.22749
H  -4.983456 0.464879 -1.765224
H  -3.057343 -2.658202 1.904194
H  -4.102394 -2.91958 0.489859
H  -4.590668 -1.773022 1.737758
H  5.275174 -0.933347 1.209603
H  3.722838 -0.535487 2.018215
H  4.452245 -2.153262 2.216491
H  -1.103602 -1.147857 1.253323
totalener: -2388.65839684 hartree
nucrepener: 2536.64797303 hartree
electener: -4925.30636988 hartree
oneelecener: -8307.35532294 hartree
twoeener: 3382.04895307 hartree
kineticenergy: 2382.51739723 hartree
xcener: -157.543961821467 hartree
chargesum: 1.0000000
charge: 0.010104 -0.002626 0.829043 -0.157639 -0.158368 -0.270582 -0.485141 -0.410802 -0.066268 -0.134691 -0.006152 -0.225732 0.151209 0.330252 0.252620 0.166884 -0.224306 -0.086487 -0.048634 -0.006785 0.395872 -0.167710 -0.262329 0.150232 0.156557 0.137888 0.139438 0.097518 0.143321 0.142876 0.131950 0.116973 0.144467 0.217049
charge: 0.487251 0.478843 0.660504 0.214111 0.213749 0.168473 -0.268436 -0.224102 0.266076 0.297774 0.404224 0.137268 -0.181595 -0.441036 -0.128022 -0.201621 0.023106 -0.387926 -0.378144 -0.026649 -0.383044 0.072836 -0.097097 0.036663 -0.043797 0.039871 0.036044 0.042114 0.053555 0.053520 0.013850 0.007060 0.020212 0.034369
qa: 0.0101 -0.0026 0.8290 -0.1576 -0.1584 -0.2706 -0.4851 -0.4108 -0.0663 -0.1347 -0.0062 -0.2257 0.1512 0.3303 0.2526 0.1669 -0.2243 -0.0865 -0.0486 -0.0068 0.3959 -0.1677 -0.2623 0.1502 0.1566 0.1379 0.1394 0.0975 0.1433 0.1429 0.1320 0.1170 0.1445 0.2170
va: 1.3316 1.3238 5.8816 1.1447 1.1443 2.2499 1.9876 2.1023 3.1729 3.3459 3.4835 3.1021 3.5711 4.3336 3.9562 3.8308 4.2207 4.2118 4.1394 3.8735 4.1667 3.9312 3.9179 1.0336 1.0525 1.0091 0.9953 1.0123 1.0007 0.9997 1.0118 1.0052 1.0131 0.9958
dispcorr: -0.019562977 hartree
energy: -2388.681219448805
dipole: 8.13264 -10.26605 -2.13341 -15.39445 14.77409 -0.62036 8.54212 -6.58134 1.96078
magnitude: 2.96326 au
magnitude: 7.53202 debye
temp: 298.15 k
press: 1.00 atm
zeropoint: 0.23694358 hartree
thermalvibcorrection: 0.01940638 hartree
thermalrotcorrection: 0.00141627 hartree
thermaltrasncorrection: 0.00141627 hartree
thermaltotal: -2388.42203694 hartree
thermalcorr: 0.02223893 hartree
nonthermalcorr: 0.23694358 hartree
totalcorr: 0.25918251 hartree
thermalcorrenthalpy: 0.00094421 hartree
totalenthalpy: -2388.42109273 hartree
totalentropycorr: -0.07312914 hartree
gibbsenthalpy: -2388.49422187 hartree
gibbsminuselec: 0.18699758 hartree
