program: Orca
programVersion: 5.0.2
elementType: Cl S O N N C C C C C C C C C C C C C C C C C C C H H H H H H H H H H H H H H H H H H H H H H H H H H
charge: 1
multiplicity: 1
keywords: wB97X-D3 TightOpt Freq def2-TZVPP def2/J RIJCOSX TightSCF defgrid3 CHELPG
frequency: 0.00 0.00 0.00 0.00 0.00 0.00 4.44 20.59 26.01 37.99 41.48 54.72 63.87 85.65 100.29 113.89 166.90 185.63 204.51 208.41 221.28 230.65 243.64 263.07 272.53 276.72 295.83 307.30 320.07 333.20 336.03 344.87 347.72 366.66 372.60 389.69 405.79 416.54 421.82 437.21 458.71 460.67 473.93 510.25 528.51 551.99 582.50 583.18 642.04 647.03 659.73 665.92 685.52 726.49 789.79 793.76 816.04 835.58 866.45 871.63 871.86 884.73 909.15 946.74 950.48 959.21 961.29 963.11 968.81 989.16 990.30 1003.75 1019.71 1045.78 1051.82 1053.27 1057.25 1062.13 1139.34 1145.50 1146.72 1165.48 1196.37 1203.97 1221.26 1224.17 1240.26 1248.54 1250.41 1252.23 1270.45 1281.65 1300.32 1312.85 1334.17 1360.47 1411.57 1412.72 1413.02 1429.07 1429.65 1443.07 1456.80 1464.37 1467.61 1475.53 1479.98 1483.28 1487.89 1489.60 1492.80 1494.31 1506.57 1511.00 1515.00 1522.83 1526.56 1541.33 1560.51 1571.75 1582.59 1654.05 1671.18 1696.80 3046.23 3054.54 3056.04 3060.63 3074.24 3088.56 3126.30 3129.17 3130.55 3133.45 3133.71 3137.29 3138.56 3140.78 3151.03 3163.17 3166.22 3172.19 3188.22 3188.71 3189.63 3198.46 3214.87 3215.63 3237.20 3825.44
frequency: 4.44 20.59 26.01 37.99 41.48 54.72 63.87 85.65 100.29 113.89 166.90 185.63 204.51 208.41 221.28 230.65 243.64 263.07 272.53 276.72 295.83 307.30 320.07 333.20 336.03 344.87 347.72 366.66 372.60 389.69 405.79 416.54 421.82 437.21 458.71 460.67 473.93 510.25 528.51 551.99 582.50 583.18 642.04 647.03 659.73 665.92 685.52 726.49 789.79 793.76 816.04 835.58 866.45 871.63 871.86 884.73 909.15 946.74 950.48 959.21 961.29 963.11 968.81 989.16 990.30 1003.75 1019.71 1045.78 1051.82 1053.27 1057.25 1062.13 1139.34 1145.50 1146.72 1165.48 1196.37 1203.97 1221.26 1224.17 1240.26 1248.54 1250.41 1252.23 1270.45 1281.65 1300.32 1312.85 1334.17 1360.47 1411.57 1412.72 1413.02 1429.07 1429.65 1443.07 1456.80 1464.37 1467.61 1475.53 1479.98 1483.28 1487.89 1489.60 1492.80 1494.31 1506.57 1511.00 1515.00 1522.83 1526.56 1541.33 1560.51 1571.75 1582.59 1654.05 1671.18 1696.80 3046.23 3054.54 3056.04 3060.63 3074.24 3088.56 3126.30 3129.17 3130.55 3133.45 3133.71 3137.29 3138.56 3140.78 3151.03 3163.17 3166.22 3172.19 3188.22 3188.71 3189.63 3198.46 3214.87 3215.63 3237.20 3825.44
formula: C19H26ClN2OS
InChI: InChI=1S/C19H26ClN2OS/c1-18(2,3)14-9-7-13(8-10-14)12-24-15-11-21-22(19(4,5)6)17(23)16(15)20/h7-11,23H,12H2,1-6H3
50 atoms
Cl -1.775174 2.611274 0.17158
S  -0.059834 0.023036 -1.518031
O  -4.479191 1.951888 0.334341
N  -4.460497 -0.067343 -0.802961
N  -3.789057 -1.005101 -1.464906
C  6.488193 -0.222526 -1.947276
C  -5.950925 -0.350903 -0.599924
C  5.046575 0.144688 -1.5938
C  7.083794 -1.233821 -0.96613
C  6.522939 -0.836256 -3.355182
C  7.349774 1.049116 -1.917392
C  -6.175692 -0.636485 0.886058
C  -6.322588 -1.583825 -1.416876
C  -6.787204 0.833685 -1.111615
C  4.340545 1.041254 -2.398998
C  4.386807 -0.371044 -0.482301
C  2.394389 0.884045 -0.992867
C  3.039409 1.404633 -2.110037
C  3.081019 -0.010622 -0.1858
C  -3.834272 1.010377 -0.310284
C  0.97751 1.273587 -0.67784
C  -1.724911 0.201407 -1.129104
C  -2.442573 1.176465 -0.465325
C  -2.51601 -0.884693 -1.62025
H  8.106352 -1.468742 -1.262687
H  7.121682 -0.841767 0.051615
H  6.523049 -2.170158 -0.95575
H  6.159745 -0.141951 -4.113315
H  7.545988 -1.107543 -3.620087
H  5.910291 -1.737997 -3.403819
H  8.384678 0.80702 -2.16416
H  7.003765 1.792837 -2.635825
H  7.336135 1.507191 -0.927143
H  -5.895297 0.189451 1.540512
H  -5.613722 -1.517371 1.194381
H  -7.233723 -0.836893 1.049345
H  -5.762022 -2.463094 -1.113746
H  -6.16855 -1.426998 -2.482941
H  -7.381158 -1.774345 -1.245888
H  -7.792186 0.473575 -1.321789
H  -6.384819 1.244783 -2.036991
H  -6.933662 1.648891 -0.396344
H  4.81566 1.472346 -3.270725
H  4.890286 -1.064756 0.175535
H  2.524234 2.107194 -2.755525
H  2.599722 -0.429805 0.690869
H  0.778287 1.233468 0.389207
H  0.738491 2.258402 -1.066201
H  -2.040826 -1.690949 -2.1658
H  -5.434038 1.835625 0.308543
totalener: -1782.64525900 hartree
nucrepener: 2303.69344689 hartree
electener: -4086.33870589 hartree
oneelecener: -6994.94437717 hartree
twoeener: 2908.60567128 hartree
kineticenergy: 1777.03126049 hartree
xcener: -132.639192736139 hartree
chargesum: 1.0000000
charge: 0.036385 0.067014 -0.218227 0.157354 -0.234105 0.240646 0.005876 -0.056523 -0.329523 -0.284852 -0.282681 -0.269244 -0.188014 -0.276824 -0.147396 -0.136625 -0.016360 -0.159830 -0.124381 0.383547 -0.156820 0.078361 -0.130495 0.038087 0.099981 0.096011 0.096416 0.088042 0.097412 0.099281 0.097219 0.088200 0.101706 0.098612 0.123164 0.121376 0.113196 0.121407 0.098931 0.119026 0.130507 0.091161 0.119653 0.131470 0.117565 0.114061 0.145541 0.139549 0.133156 0.221990
charge: 0.535574 0.769194 0.451902 0.270664 0.174801 -0.172857 -0.185312 -0.029972 0.018317 0.027067 0.027987 0.034142 0.029332 0.040779 0.015663 0.013523 -0.144223 -0.002858 -0.002295 -0.261031 -0.196172 -0.345984 -0.424272 -0.108754 0.022422 0.016636 0.016495 0.013323 0.020638 0.018598 0.020567 0.013971 0.019471 0.014269 0.030166 0.037032 0.023610 0.027653 0.031596 0.041847 0.029661 0.018287 0.026880 0.026339 0.025386 0.024793 0.012490 0.009028 0.038796 -0.115168
qa: 0.0364 0.0670 -0.2182 0.1574 -0.2341 0.2406 0.0059 -0.0565 -0.3295 -0.2849 -0.2827 -0.2692 -0.1880 -0.2768 -0.1474 -0.1366 -0.0164 -0.1598 -0.1244 0.3835 -0.1568 0.0784 -0.1305 0.0381 0.1000 0.0960 0.0964 0.0880 0.0974 0.0993 0.0972 0.0882 0.1017 0.0986 0.1232 0.1214 0.1132 0.1214 0.0989 0.1190 0.1305 0.0912 0.1197 0.1315 0.1176 0.1141 0.1455 0.1395 0.1332 0.2220
va: 1.3565 2.5894 2.3167 3.3112 2.9382 3.7660 4.0024 3.7653 3.9330 3.9212 3.9210 3.9499 3.8190 3.8896 4.0870 4.0054 3.7300 4.0694 4.0501 4.0199 3.9541 3.8678 4.0209 4.0291 1.0125 1.0017 1.0016 1.0078 1.0074 1.0052 1.0070 1.0076 1.0054 1.0141 1.0046 1.0049 1.0156 1.0099 1.0054 1.0066 1.0027 1.0129 1.0111 1.0051 1.0103 1.0121 0.9955 1.0012 1.0069 1.0676
dispcorr: -0.024174546 hartree
energy: -1782.674751257941
dipole: 18.90318 -24.00380 -5.10062 -14.40406 14.23859 -0.16547 -6.49399 6.99301 0.49903
magnitude: 5.12765 au
magnitude: 13.03345 debye
temp: 298.15 k
press: 1.00 atm
zeropoint: 0.42283320 hartree
thermalvibcorrection: 0.02237386 hartree
thermalrotcorrection: 0.00141627 hartree
thermaltrasncorrection: 0.00141627 hartree
thermaltotal: -1782.22671166 hartree
thermalcorr: 0.02520640 hartree
nonthermalcorr: 0.42283320 hartree
totalcorr: 0.44803960 hartree
thermalcorrenthalpy: 0.00094421 hartree
totalenthalpy: -1782.22576745 hartree
totalentropycorr: -0.07807712 hartree
gibbsenthalpy: -1782.30384458 hartree
gibbsminuselec: 0.37090668 hartree
