program: Orca
programVersion: 5.0.2
elementType: S N N N N N C C C C C C C C C C H H H H H H H H H H H H H H H H H H H H
charge: 1
multiplicity: 1
keywords: wB97X-D3 TightOpt Freq def2-TZVPP def2/J RIJCOSX TightSCF defgrid3
frequency: 0.00 0.00 0.00 0.00 0.00 0.00 37.10 45.11 51.01 61.51 77.86 84.51 121.24 146.93 168.69 193.94 198.94 228.74 230.02 232.56 253.79 257.70 268.86 297.50 351.60 359.65 410.62 417.41 428.83 464.93 470.65 499.02 556.95 561.54 652.27 670.68 681.72 716.74 751.01 751.76 820.60 847.24 877.47 924.09 945.14 946.78 964.43 970.36 977.22 979.58 990.94 994.46 1052.48 1139.27 1164.22 1165.54 1184.79 1199.26 1205.07 1210.01 1229.66 1322.12 1332.29 1368.64 1375.81 1380.06 1396.52 1411.36 1420.12 1421.58 1436.20 1439.09 1439.68 1485.33 1486.19 1488.99 1489.93 1494.83 1495.57 1507.10 1508.79 1514.14 1514.37 1575.11 1577.23 1647.69 1682.46 1723.22 3059.04 3062.08 3065.79 3065.96 3067.93 3108.37 3113.52 3137.77 3139.71 3148.16 3148.52 3154.23 3157.11 3162.45 3162.89 3164.40 3174.10 3643.62 3660.86 3666.30
frequency: 37.10 45.11 51.01 61.51 77.86 84.51 121.24 146.93 168.69 193.94 198.94 228.74 230.02 232.56 253.79 257.70 268.86 297.50 351.60 359.65 410.62 417.41 428.83 464.93 470.65 499.02 556.95 561.54 652.27 670.68 681.72 716.74 751.01 751.76 820.60 847.24 877.47 924.09 945.14 946.78 964.43 970.36 977.22 979.58 990.94 994.46 1052.48 1139.27 1164.22 1165.54 1184.79 1199.26 1205.07 1210.01 1229.66 1322.12 1332.29 1368.64 1375.81 1380.06 1396.52 1411.36 1420.12 1421.58 1436.20 1439.09 1439.68 1485.33 1486.19 1488.99 1489.93 1494.83 1495.57 1507.10 1508.79 1514.14 1514.37 1575.11 1577.23 1647.69 1682.46 1723.22 3059.04 3062.08 3065.79 3065.96 3067.93 3108.37 3113.52 3137.77 3139.71 3148.16 3148.52 3154.23 3157.11 3162.45 3162.89 3164.40 3174.10 3643.62 3660.86 3666.30
formula: C10H20N5S
InChI: InChI=1S/C10H20N5S/c1-6(2)11-8-13-9(12-7(3)4)15-10(14-8)16-5/h6-7,11-12,14H,1-5H3
36 atoms
S  3.502354 -1.43183 -0.018508
N  -1.307586 -2.079008 -0.071536
N  0.121758 2.275948 0.085468
N  -0.659877 0.117944 0.006469
N  1.639227 0.527448 0.034675
N  0.929023 -1.68067 -0.044946
C  -2.745923 -1.789731 -0.04474
C  -1.219629 2.887303 0.060402
C  -3.226497 -1.597604 1.387753
C  -3.475981 -2.91346 -0.762277
C  -1.745613 2.970282 -1.36517
C  -1.136368 4.24433 0.738682
C  -0.341965 -1.186997 -0.032706
C  0.333986 0.969719 0.0385
C  1.886902 -0.815895 -0.008937
C  4.522893 0.047842 0.026224
H  -2.878446 -0.858083 -0.595075
H  -1.859391 2.225025 0.643273
H  -1.005348 -3.040781 -0.083673
H  0.910202 2.900486 0.069884
H  -2.684354 -0.78873 1.877093
H  -3.08909 -2.510227 1.969764
H  -4.287379 -1.348912 1.394844
H  -3.336722 -3.86546 -0.24487
H  -4.544494 -2.70613 -0.783679
H  -3.130412 -3.021619 -1.790148
H  -2.754389 3.382032 -1.365573
H  -1.116506 3.619719 -1.976326
H  -1.782768 1.983966 -1.826475
H  -0.78098 4.158121 1.765393
H  -2.12193 4.705878 0.760828
H  -0.473414 4.91927 0.191449
H  4.384089 0.668444 -0.858142
H  5.546666 -0.321112 0.013143
H  4.387514 0.612665 0.947788
H  2.402463 1.181244 0.074814
totalener: -1064.98095336 hartree
nucrepener: 1274.94867910 hartree
electener: -2339.92963245 hartree
oneelecener: -3966.92731327 hartree
twoeener: 1626.99768082 hartree
kineticenergy: 1061.23909925 hartree
xcener: -85.035435153643 hartree
chargesum: 1.0000000
charge: 0.105141 -0.143947 -0.176962 -0.417570 -0.167141 -0.329088 0.066881 0.075264 -0.239024 -0.227477 -0.239035 -0.229263 0.427748 0.416774 0.223558 -0.297786 0.067425 0.075563 0.169083 0.132192 0.087322 0.095266 0.099491 0.088915 0.093510 0.110278 0.103164 0.090001 0.094181 0.111474 0.098092 0.084389 0.122586 0.150386 0.122287 0.156322
charge: 0.730939 0.388592 0.368363 0.142475 0.358154 0.127352 -0.126054 -0.120656 0.020001 0.021391 0.020673 0.020961 -0.311257 -0.281944 -0.484987 -0.187288 0.028349 0.031430 0.007364 -0.012571 0.013061 0.019724 0.024593 0.019034 0.027515 0.019028 0.026583 0.018242 0.014978 0.018792 0.030221 0.017563 -0.001638 0.021484 -0.001771 -0.008697
qa: 0.1051 -0.1439 -0.1770 -0.4176 -0.1671 -0.3291 0.0669 0.0753 -0.2390 -0.2275 -0.2390 -0.2293 0.4277 0.4168 0.2236 -0.2978 0.0674 0.0756 0.1691 0.1322 0.0873 0.0953 0.0995 0.0889 0.0935 0.1103 0.1032 0.0900 0.0942 0.1115 0.0981 0.0844 0.1226 0.1504 0.1223 0.1563
va: 2.4886 3.3125 3.3015 2.9771 3.3946 3.0058 3.8861 3.8644 3.9192 3.9058 3.9197 3.9046 4.1508 4.1251 4.2280 3.9696 1.0102 1.0120 1.0256 1.0403 1.0099 1.0097 1.0085 1.0052 1.0103 1.0054 1.0085 1.0107 1.0102 1.0044 1.0110 1.0047 0.9970 1.0050 0.9968 1.0357
dispcorr: -0.014204626 hartree
energy: -1064.995174680924
dipole: -18.59404 19.63970 1.04566 12.11342 -10.67833 1.43509 0.15899 -0.11605 0.04295
magnitude: 1.77616 au
magnitude: 4.51464 debye
temp: 298.15 k
press: 1.00 atm
zeropoint: 0.31321890 hartree
thermalvibcorrection: 0.01561793 hartree
thermalrotcorrection: 0.00141627 hartree
thermaltrasncorrection: 0.00141627 hartree
thermaltotal: -1064.66350531 hartree
thermalcorr: 0.01845047 hartree
nonthermalcorr: 0.31321890 hartree
totalcorr: 0.33166937 hartree
thermalcorrenthalpy: 0.00094421 hartree
totalenthalpy: -1064.66256110 hartree
totalentropycorr: -0.06363712 hartree
gibbsenthalpy: -1064.72619822 hartree
gibbsminuselec: 0.26897646 hartree
