program: Orca
programVersion: 5.0.2
elementType: S P O O O N N N C C C C C C C C C C C H H H H H H H H H H H H H H H H H H H H H
charge: 1
multiplicity: 1
keywords: wB97X-D3 TightOpt Freq def2-TZVPP def2/J RIJCOSX TightSCF defgrid3
frequency: 0.00 0.00 0.00 0.00 0.00 0.00 25.12 30.38 35.24 54.58 60.42 71.73 78.61 85.81 97.89 101.09 113.08 127.62 153.94 157.09 178.40 193.16 213.29 231.71 235.17 252.80 256.38 302.21 323.26 326.50 353.02 400.35 410.16 440.18 465.67 514.54 542.61 551.68 582.43 616.60 633.31 675.48 704.89 710.31 784.21 796.34 803.65 809.59 851.82 865.33 872.27 887.99 956.85 995.70 1011.38 1023.18 1052.15 1062.07 1075.15 1107.94 1114.42 1121.16 1128.02 1128.95 1185.13 1186.23 1205.55 1208.11 1212.47 1223.28 1250.88 1307.09 1338.55 1349.87 1381.77 1391.89 1409.13 1413.84 1431.43 1436.94 1462.88 1474.02 1482.70 1488.91 1491.94 1493.51 1495.68 1499.61 1500.36 1503.11 1504.65 1506.52 1508.25 1511.29 1519.21 1550.53 1614.70 1698.04 1730.11 3059.03 3064.59 3069.21 3072.68 3077.23 3083.62 3102.60 3132.31 3143.54 3146.62 3149.61 3158.81 3160.11 3166.70 3174.29 3177.66 3194.63 3194.91 3205.22 3268.60 3561.35
frequency: 25.12 30.38 35.24 54.58 60.42 71.73 78.61 85.81 97.89 101.09 113.08 127.62 153.94 157.09 178.40 193.16 213.29 231.71 235.17 252.80 256.38 302.21 323.26 326.50 353.02 400.35 410.16 440.18 465.67 514.54 542.61 551.68 582.43 616.60 633.31 675.48 704.89 710.31 784.21 796.34 803.65 809.59 851.82 865.33 872.27 887.99 956.85 995.70 1011.38 1023.18 1052.15 1062.07 1075.15 1107.94 1114.42 1121.16 1128.02 1128.95 1185.13 1186.23 1205.55 1208.11 1212.47 1223.28 1250.88 1307.09 1338.55 1349.87 1381.77 1391.89 1409.13 1413.84 1431.43 1436.94 1462.88 1474.02 1482.70 1488.91 1491.94 1493.51 1495.68 1499.61 1500.36 1503.11 1504.65 1506.52 1508.25 1511.29 1519.21 1550.53 1614.70 1698.04 1730.11 3059.03 3064.59 3069.21 3072.68 3077.23 3083.62 3102.60 3132.31 3143.54 3146.62 3149.61 3158.81 3160.11 3166.70 3174.29 3177.66 3194.63 3194.91 3205.22 3268.60 3561.35
formula: C11H21N3O3PS
InChI: InChI=1S/C11H21N3O3PS/c1-6-14(7-2)11-12-9(3)8-10(13-11)17-18(19,15-4)16-5/h8,13H,6-7H2,1-5H3
40 atoms
S  2.230544 -0.168716 2.044243
P  2.426606 0.061728 0.185759
O  1.439729 1.192661 -0.5009
O  3.809334 0.55153 -0.324362
O  1.981701 -1.161729 -0.744297
N  -2.549022 -1.065589 -0.062569
N  -2.57683 1.238808 0.122558
N  -0.572188 0.114449 -0.310388
C  -3.995597 -1.119513 0.194909
C  -1.850522 -2.328975 -0.296648
C  -1.917376 0.097845 -0.078554
C  -4.808764 -1.053924 -1.085537
C  -1.131368 -2.852748 0.939725
C  -1.909636 2.378965 0.132593
C  0.131237 1.273751 -0.278442
C  -0.514416 2.447305 -0.061743
C  -2.686736 3.622655 0.397118
C  4.116649 0.847226 -1.700499
C  2.558972 -2.465699 -0.521242
H  -4.177632 -2.050319 0.732406
H  -4.251411 -0.298751 0.858728
H  -2.603937 -3.041925 -0.626376
H  -1.169672 -2.219947 -1.146194
H  -4.648431 -0.103539 -1.593896
H  -4.548691 -1.862786 -1.769589
H  -5.869752 -1.140602 -0.854761
H  -0.359336 -2.167012 1.295303
H  -1.835578 -3.007857 1.756326
H  -0.659257 -3.80909 0.716824
H  0.033332 3.375369 -0.02702
H  -2.331935 4.447471 -0.218991
H  -3.745603 3.452022 0.226386
H  -2.547058 3.910494 1.441951
H  5.196288 0.940172 -1.751874
H  3.644973 1.785472 -1.98407
H  3.776906 0.040713 -2.348451
H  3.63464 -2.430854 -0.686818
H  2.096786 -3.1304 -1.244503
H  2.349765 -2.796138 0.495115
H  -0.05369 -0.736784 -0.489207
totalener: -1561.29569920 hartree
nucrepener: 1936.76240522 hartree
electener: -3498.05810442 hartree
oneelecener: -5970.32565705 hartree
twoeener: 2472.26755264 hartree
kineticenergy: 1556.33380055 hartree
xcener: -114.894220169612 hartree
chargesum: 1.0000000
charge: -0.248890 0.644732 -0.302016 -0.275792 -0.353926 -0.088890 -0.365404 -0.134667 -0.040911 -0.109054 0.429378 -0.232500 -0.204655 0.168531 0.327601 -0.170739 -0.212241 -0.132555 -0.134910 0.106808 0.109103 0.120929 0.088290 0.092299 0.079097 0.108894 0.048884 0.107169 0.106203 0.146875 0.106087 0.115090 0.118726 0.143347 0.126403 0.118082 0.142704 0.127359 0.129129 0.195430
charge: 0.039136 -0.019352 0.193258 0.125404 0.074957 0.298877 0.179508 0.407520 -0.034546 -0.050177 -0.255724 0.016858 0.015386 -0.115421 -0.264583 -0.001740 0.051907 -0.027730 -0.048223 0.026909 0.026419 0.036526 0.018919 0.017324 0.013055 0.025752 0.006538 0.023176 0.023949 0.040646 0.032850 0.033479 0.042859 0.020573 0.008956 0.003793 0.013458 0.013220 0.005133 -0.018847
qa: -0.2489 0.6447 -0.3020 -0.2758 -0.3539 -0.0889 -0.3654 -0.1347 -0.0409 -0.1091 0.4294 -0.2325 -0.2047 0.1685 0.3276 -0.1707 -0.2122 -0.1326 -0.1349 0.1068 0.1091 0.1209 0.0883 0.0923 0.0791 0.1089 0.0489 0.1072 0.1062 0.1469 0.1061 0.1151 0.1187 0.1433 0.1264 0.1181 0.1427 0.1274 0.1291 0.1954
va: 2.1899 5.5405 2.1782 2.1948 2.0264 3.2572 3.0190 3.4091 3.8330 3.8814 4.0286 3.9287 3.8992 3.9297 4.1165 3.9409 3.9104 3.8435 3.8263 0.9923 1.0154 0.9971 1.0015 1.0064 1.0086 1.0091 1.0410 1.0132 1.0085 1.0066 1.0024 1.0132 0.9992 0.9885 0.9902 0.9887 0.9919 0.9868 0.9962 1.0402
dispcorr: -0.020475035 hartree
energy: -1561.316265096538
dipole: -20.34606 19.23048 -1.11559 -10.77310 10.21416 -0.55894 -7.45705 5.94285 -1.51421
magnitude: 1.96208 au
magnitude: 4.98722 debye
temp: 298.15 k
press: 1.00 atm
zeropoint: 0.33508741 hartree
thermalvibcorrection: 0.01968896 hartree
thermalrotcorrection: 0.00141627 hartree
thermaltrasncorrection: 0.00141627 hartree
thermaltotal: -1560.95865618 hartree
thermalcorr: 0.02252151 hartree
nonthermalcorr: 0.33508741 hartree
totalcorr: 0.35760892 hartree
thermalcorrenthalpy: 0.00094421 hartree
totalenthalpy: -1560.95771197 hartree
totalentropycorr: -0.07272427 hartree
gibbsenthalpy: -1561.03043624 hartree
gibbsminuselec: 0.28582886 hartree
