program: Orca
programVersion: 5.0.2
elementType: Cl N N N N C C C C C C C C C C C C C C C H H H H H H H H H H H H H H H H H H
charge: 1
multiplicity: 1
keywords: wB97X-D3 TightOpt Freq def2-TZVPP def2/J RIJCOSX TightSCF defgrid3
frequency: 0.00 0.00 0.00 0.00 0.00 0.00 23.73 37.21 50.85 59.41 63.22 66.72 86.81 121.90 125.81 131.82 169.13 187.62 208.59 221.40 247.79 264.64 305.80 342.33 357.73 374.01 422.13 427.01 440.29 460.28 544.79 548.28 592.24 646.31 651.48 654.32 670.49 683.36 740.92 748.49 767.06 776.03 799.83 868.49 875.49 885.65 923.06 940.81 952.61 963.10 965.66 1000.56 1025.85 1029.43 1034.87 1047.78 1074.98 1078.40 1092.15 1113.72 1145.68 1152.29 1153.81 1165.32 1190.44 1199.03 1218.03 1226.49 1243.57 1294.55 1302.52 1310.18 1313.33 1336.45 1345.39 1348.47 1364.86 1371.18 1392.14 1425.45 1429.48 1431.68 1456.41 1478.90 1489.34 1496.30 1496.78 1504.25 1506.84 1517.21 1549.99 1555.87 1602.10 1646.46 1679.96 2399.53 3045.30 3051.42 3060.13 3061.03 3076.87 3094.58 3112.13 3117.66 3132.97 3148.00 3177.59 3193.10 3212.87 3231.99 3234.64 3281.65 3285.49 3555.96
frequency: 23.73 37.21 50.85 59.41 63.22 66.72 86.81 121.90 125.81 131.82 169.13 187.62 208.59 221.40 247.79 264.64 305.80 342.33 357.73 374.01 422.13 427.01 440.29 460.28 544.79 548.28 592.24 646.31 651.48 654.32 670.49 683.36 740.92 748.49 767.06 776.03 799.83 868.49 875.49 885.65 923.06 940.81 952.61 963.10 965.66 1000.56 1025.85 1029.43 1034.87 1047.78 1074.98 1078.40 1092.15 1113.72 1145.68 1152.29 1153.81 1165.32 1190.44 1199.03 1218.03 1226.49 1243.57 1294.55 1302.52 1310.18 1313.33 1336.45 1345.39 1348.47 1364.86 1371.18 1392.14 1425.45 1429.48 1431.68 1456.41 1478.90 1489.34 1496.30 1496.78 1504.25 1506.84 1517.21 1549.99 1555.87 1602.10 1646.46 1679.96 2399.53 3045.30 3051.42 3060.13 3061.03 3076.87 3094.58 3112.13 3117.66 3132.97 3148.00 3177.59 3193.10 3212.87 3231.99 3234.64 3281.65 3285.49 3555.96
formula: C15H18ClN4
InChI: InChI=1S/C15H18ClN4/c1-2-3-8-15(9-17,10-20-12-18-11-19-20)13-4-6-14(16)7-5-13/h4-7,11-12,19H,2-3,8,10H2,1H3
38 atoms
Cl 2.390658 4.065859 0.164514
N  1.220218 -2.309007 -0.592749
N  2.262019 -1.456539 -0.639269
N  2.952936 -3.276781 0.350151
N  -1.014515 -2.275282 2.105746
C  -0.876357 -0.995863 -0.171005
C  -2.292457 -0.786321 -0.756827
C  -0.114361 -1.981549 -1.091187
C  -3.168417 0.138403 0.078091
C  -0.093192 0.311617 -0.046457
C  -4.56265 0.303387 -0.517352
C  -0.982958 -1.673266 1.130088
C  0.391842 0.771679 1.170758
C  0.185156 1.048752 -1.198581
C  -5.44288 1.227039 0.313031
C  1.151021 1.930669 1.242561
C  0.949348 2.202127 -1.139766
C  1.675507 -3.400621 0.016961
C  1.437257 2.638353 0.086354
C  3.290925 -2.065615 -0.057344
H  -2.773989 -1.76304 -0.854929
H  -2.185336 -0.384528 -1.767944
H  -0.010914 -1.569687 -2.093536
H  -0.646658 -2.927871 -1.165559
H  -2.690889 1.118612 0.164166
H  -3.25235 -0.257035 1.09497
H  -5.037489 -0.678149 -0.603336
H  -4.477321 0.692902 -1.536243
H  0.180229 0.228764 2.083381
H  -0.20783 0.743699 -2.1618
H  -5.572608 0.842516 1.325982
H  -6.432298 1.330779 -0.130605
H  -5.007376 2.224915 0.389272
H  1.518604 2.283903 2.196221
H  1.155211 2.77164 -2.035786
H  1.051134 -4.261975 0.199353
H  4.259397 -1.60171 0.048825
H  2.138927 -0.502244 -0.960951
totalener: -1261.44472135 hartree
nucrepener: 1659.86774049 hartree
electener: -2921.31246184 hartree
oneelecener: -4996.06030105 hartree
twoeener: 2074.74783921 hartree
kineticenergy: 1257.18901110 hartree
xcener: -100.435589067370 hartree
chargesum: 1.0000000
charge: -0.002213 0.077143 -0.060028 -0.266494 0.066902 0.721672 -0.200776 -0.226259 -0.129210 -0.384254 -0.091722 -0.445628 -0.072337 -0.250824 -0.250508 -0.103989 -0.141529 0.183816 0.079638 0.188787 0.114561 0.106553 0.171858 0.147400 0.080477 0.092925 0.067922 0.063978 0.152440 0.133331 0.081959 0.098852 0.076685 0.149629 0.151658 0.184158 0.191567 0.241857
charge: 0.461552 0.305766 0.389732 0.180170 0.106439 -0.158099 0.010348 0.019079 -0.020647 -0.085533 -0.038969 -0.155922 0.012301 -0.019891 0.008337 -0.008922 -0.023053 -0.070888 -0.396274 -0.074357 0.038261 0.031952 0.043649 0.055128 0.026564 0.031078 0.021046 0.019229 0.039949 0.028094 0.014698 0.016930 0.012924 0.036789 0.035070 0.045442 0.041951 0.020075
qa: -0.0022 0.0771 -0.0600 -0.2665 0.0669 0.7217 -0.2008 -0.2263 -0.1292 -0.3843 -0.0917 -0.4456 -0.0723 -0.2508 -0.2505 -0.1040 -0.1415 0.1838 0.0796 0.1888 0.1146 0.1066 0.1719 0.1474 0.0805 0.0929 0.0679 0.0640 0.1524 0.1333 0.0820 0.0989 0.0767 0.1496 0.1517 0.1842 0.1916 0.2419
va: 1.3037 3.3590 3.4573 3.0668 3.0668 3.3698 3.8643 3.8781 3.8454 3.6466 3.9002 4.0182 3.8741 3.9880 3.9608 3.9896 4.0273 3.9888 4.0061 3.9536 1.0120 1.0061 0.9866 1.0060 1.0090 1.0108 1.0069 1.0049 1.0112 1.0211 1.0033 1.0066 1.0032 1.0081 1.0091 0.9843 0.9777 0.9889
dispcorr: -0.020343088 hartree
energy: -1261.465120941481
dipole: -31.10240 32.43590 1.33349 -7.53766 5.81223 -1.72544 -5.97623 3.84559 -2.13064
magnitude: 3.04877 au
magnitude: 7.74935 debye
temp: 298.15 k
press: 1.00 atm
zeropoint: 0.31599581 hartree
thermalvibcorrection: 0.01626222 hartree
thermalrotcorrection: 0.00141627 hartree
thermaltrasncorrection: 0.00141627 hartree
thermaltotal: -1261.13003037 hartree
thermalcorr: 0.01909476 hartree
nonthermalcorr: 0.31599581 hartree
totalcorr: 0.33509057 hartree
thermalcorrenthalpy: 0.00094421 hartree
totalenthalpy: -1261.12908616 hartree
totalentropycorr: -0.06592006 hartree
gibbsenthalpy: -1261.19500623 hartree
gibbsminuselec: 0.27011471 hartree
