program: Orca
programVersion: 5.0.2
elementType: Cl N N N N C C C C C C C C C C C C C C C H H H H H H H H H H H H H H H H H H
charge: 1
multiplicity: 1
keywords: wB97X-D3 TightOpt Freq def2-TZVPP def2/J RIJCOSX TightSCF defgrid3
frequency: 0.00 0.00 0.00 0.00 0.00 0.00 24.10 36.48 39.64 50.23 63.01 66.89 96.09 126.12 129.53 143.05 170.18 186.84 208.92 225.78 248.23 264.40 316.51 330.33 361.96 371.77 421.98 424.49 441.78 463.65 544.12 548.10 612.86 651.31 652.70 656.62 671.53 689.82 740.33 748.47 766.35 776.63 799.34 868.46 870.56 877.10 922.78 940.33 952.31 964.38 966.53 997.94 1021.50 1026.70 1035.05 1048.40 1070.06 1081.29 1090.87 1108.79 1146.36 1153.63 1155.06 1168.48 1190.13 1199.98 1226.81 1228.60 1242.78 1296.43 1300.41 1312.54 1314.86 1337.65 1345.96 1348.79 1363.69 1371.22 1392.69 1425.19 1428.95 1431.71 1458.69 1480.36 1489.67 1495.90 1496.36 1504.30 1506.82 1517.06 1553.38 1560.56 1607.62 1651.53 1683.42 2383.72 3044.10 3050.72 3061.01 3061.90 3077.32 3096.17 3111.93 3114.80 3133.19 3148.19 3179.34 3193.51 3207.12 3233.32 3235.26 3282.74 3285.79 3511.35
frequency: 24.10 36.48 39.64 50.23 63.01 66.89 96.09 126.12 129.53 143.05 170.18 186.84 208.92 225.78 248.23 264.40 316.51 330.33 361.96 371.77 421.98 424.49 441.78 463.65 544.12 548.10 612.86 651.31 652.70 656.62 671.53 689.82 740.33 748.47 766.35 776.63 799.34 868.46 870.56 877.10 922.78 940.33 952.31 964.38 966.53 997.94 1021.50 1026.70 1035.05 1048.40 1070.06 1081.29 1090.87 1108.79 1146.36 1153.63 1155.06 1168.48 1190.13 1199.98 1226.81 1228.60 1242.78 1296.43 1300.41 1312.54 1314.86 1337.65 1345.96 1348.79 1363.69 1371.22 1392.69 1425.19 1428.95 1431.71 1458.69 1480.36 1489.67 1495.90 1496.36 1504.30 1506.82 1517.06 1553.38 1560.56 1607.62 1651.53 1683.42 2383.72 3044.10 3050.72 3061.01 3061.90 3077.32 3096.17 3111.93 3114.80 3133.19 3148.19 3179.34 3193.51 3207.12 3233.32 3235.26 3282.74 3285.79 3511.35
formula: C15H18ClN4
InChI: InChI=1S/C15H18ClN4/c1-2-3-8-15(9-17,10-20-12-18-11-19-20)13-4-6-14(16)7-5-13/h4-7,11-12,19H,2-3,8,10H2,1H3
38 atoms
Cl 2.304274 4.114627 0.217925
N  1.299415 -2.203955 -0.654467
N  1.620664 -2.88227 0.46481
N  3.485272 -2.176307 -0.429831
N  -0.952198 -2.366775 2.035146
C  -0.857845 -1.001635 -0.191168
C  -2.274629 -0.814279 -0.781375
C  -0.073467 -1.978881 -1.105544
C  -3.175628 0.068468 0.072313
C  -0.082633 0.305937 -0.046756
C  -4.567466 0.224718 -0.530976
C  -0.96975 -1.702487 1.098877
C  0.461001 0.715862 1.162945
C  0.117026 1.100155 -1.174312
C  -5.473782 1.103575 0.31969
C  1.194455 1.889649 1.251535
C  0.848606 2.270572 -1.098331
C  2.454491 -1.790473 -1.167979
C  1.390957 2.66123 0.119125
C  2.944409 -2.840636 0.577985
H  -2.732742 -1.799047 -0.909234
H  -2.169687 -0.384328 -1.780227
H  0.009983 -1.560125 -2.105766
H  -0.574862 -2.943769 -1.176437
H  -2.715935 1.053226 0.192554
H  -3.262594 -0.358324 1.076834
H  -5.021832 -0.762622 -0.65412
H  -4.479662 0.649068 -1.535555
H  0.305627 0.132736 2.062366
H  -0.312685 0.825927 -2.130855
H  -5.60719 0.683213 1.31788
H  -6.460167 1.203494 -0.131488
H  -5.058106 2.106183 0.433846
H  1.60717 2.20674 2.199216
H  0.993572 2.886607 -1.97507
H  2.505936 -1.215692 -2.079775
H  3.473235 -3.301947 1.39779
H  0.902111 -3.192235 1.115264
totalener: -1261.44664071 hartree
nucrepener: 1658.43498264 hartree
electener: -2919.88162335 hartree
oneelecener: -4993.53727755 hartree
twoeener: 2073.65565420 hartree
kineticenergy: 1257.19250838 hartree
xcener: -100.437129903843 hartree
chargesum: 1.0000000
charge: -0.011906 0.079757 -0.064596 -0.265564 0.003399 0.690454 -0.212414 -0.234927 -0.128084 -0.260595 -0.091176 -0.389025 -0.116369 -0.269882 -0.250630 -0.103719 -0.107950 0.179985 0.082054 0.183289 0.113667 0.108911 0.139935 0.181639 0.085028 0.087687 0.066718 0.065766 0.151432 0.127599 0.080738 0.098999 0.078418 0.142588 0.144438 0.173858 0.195070 0.245408
charge: 0.456128 0.306330 0.390218 0.178621 0.088032 -0.156646 0.010449 0.021454 -0.020639 -0.077770 -0.038842 -0.142795 0.004615 -0.005712 0.008584 -0.009686 -0.014029 -0.079095 -0.389163 -0.072702 0.037603 0.032789 0.050932 0.048466 0.028350 0.029822 0.020672 0.019878 0.033892 0.026691 0.014293 0.017070 0.013553 0.034424 0.033800 0.041940 0.042680 0.015798
qa: -0.0119 0.0798 -0.0646 -0.2656 0.0034 0.6905 -0.2124 -0.2349 -0.1281 -0.2606 -0.0912 -0.3890 -0.1164 -0.2699 -0.2506 -0.1037 -0.1079 0.1800 0.0821 0.1833 0.1137 0.1089 0.1399 0.1816 0.0850 0.0877 0.0667 0.0658 0.1514 0.1276 0.0807 0.0990 0.0784 0.1426 0.1444 0.1739 0.1951 0.2454
va: 1.2943 3.3628 3.4501 3.0629 3.0051 3.4181 3.8640 3.9063 3.8443 3.6233 3.8999 3.9830 3.8900 4.0493 3.9614 4.0169 4.0420 3.9870 4.0270 3.9567 1.0131 1.0048 0.9940 0.9926 1.0119 1.0116 1.0068 1.0052 1.0040 1.0195 1.0032 1.0066 1.0032 1.0101 1.0082 0.9895 0.9767 1.0066
dispcorr: -0.019879841 hartree
energy: -1261.466618264746
dipole: -31.63249 32.40239 0.76990 -9.63673 6.64298 -2.99375 -4.94071 3.72533 -1.21538
magnitude: 3.32151 au
magnitude: 8.44261 debye
temp: 298.15 k
press: 1.00 atm
zeropoint: 0.31600970 hartree
thermalvibcorrection: 0.01622789 hartree
thermalrotcorrection: 0.00141627 hartree
thermaltrasncorrection: 0.00141627 hartree
thermaltotal: -1261.13154813 hartree
thermalcorr: 0.01906043 hartree
nonthermalcorr: 0.31600970 hartree
totalcorr: 0.33507013 hartree
thermalcorrenthalpy: 0.00094421 hartree
totalenthalpy: -1261.13060392 hartree
totalentropycorr: -0.06589293 hartree
gibbsenthalpy: -1261.19649685 hartree
gibbsminuselec: 0.27012141 hartree
