program: Orca
programVersion: 5.0.2
elementType: S P O O N C C H H H H H H H H H
charge: 1
multiplicity: 1
keywords: wB97X-D3 TightOpt Freq def2-TZVPP def2/J RIJCOSX TightSCF defgrid3
frequency: 0.00 0.00 0.00 0.00 0.00 0.00 52.36 68.09 80.28 132.20 160.80 177.73 226.28 237.83 318.98 338.08 411.61 435.47 468.76 540.57 686.96 722.55 788.76 829.53 931.96 1000.54 1007.37 1091.62 1105.78 1180.21 1203.82 1367.67 1387.48 1465.00 1474.08 1491.91 1499.86 1502.52 1578.11 2711.94 3091.74 3093.23 3191.97 3202.00 3211.63 3220.26 3613.05 3726.02
frequency: 52.36 68.09 80.28 132.20 160.80 177.73 226.28 237.83 318.98 338.08 411.61 435.47 468.76 540.57 686.96 722.55 788.76 829.53 931.96 1000.54 1007.37 1091.62 1105.78 1180.21 1203.82 1367.67 1387.48 1465.00 1474.08 1491.91 1499.86 1502.52 1578.11 2711.94 3091.74 3093.23 3191.97 3202.00 3211.63 3220.26 3613.05 3726.02
formula: C2H9NO2PS
InChI: InChI=1S/C2H9NO2PS/c1-5-6(3,4)7-2/h7H,3H2,1-2H3
16 atoms
S  1.588647 0.248105 -0.638372
P  -0.459023 0.416607 0.231741
O  -0.995641 -0.781291 -0.59937
O  -0.311425 0.356791 1.672393
N  -1.053085 1.775611 -0.39364
C  2.254228 -1.109978 0.347471
C  -2.214783 -1.492737 -0.225238
H  -1.131151 2.601552 0.177572
H  -1.41903 1.834882 -1.329221
H  3.334593 -1.10254 0.227208
H  1.841787 -2.022764 -0.07592
H  1.958872 -0.9886 1.386007
H  -2.155876 -1.786859 0.819738
H  -2.252181 -2.363098 -0.870284
H  -3.074589 -0.850793 -0.401731
H  2.078796 1.283769 0.063538
totalener: -1026.26098227 hartree
nucrepener: 529.44781523 hartree
electener: -1555.70879750 hartree
oneelecener: -2452.15706293 hartree
twoeener: 896.44826543 hartree
kineticenergy: 1023.70826423 hartree
xcener: -62.660836143797 hartree
chargesum: 1.0000000
charge: 0.182881 0.726976 -0.316635 -0.426130 -0.315211 -0.216450 -0.112199 0.215064 0.200319 0.157161 0.150877 0.161642 0.146424 0.141631 0.132200 0.171447
charge: 0.872955 0.150290 0.094525 -0.180603 0.187278 -0.118988 0.005872 -0.018310 -0.024952 0.019065 0.019399 0.015531 0.016857 0.022223 0.013684 -0.074825
qa: 0.1829 0.7270 -0.3166 -0.4261 -0.3152 -0.2164 -0.1122 0.2151 0.2003 0.1572 0.1509 0.1616 0.1464 0.1416 0.1322 0.1714
va: 2.8909 5.5581 2.1482 2.2105 3.2257 3.8378 3.7913 0.9971 1.0070 1.0000 1.0009 1.0089 0.9883 0.9861 0.9906 0.9946
dispcorr: -0.004815387 hartree
energy: -1026.265812841601
dipole: -0.46638 1.01087 0.54449 -3.78671 4.02372 0.23701 -0.16876 -0.87212 -1.04088
magnitude: 1.19837 au
magnitude: 3.04600 debye
temp: 298.15 k
press: 1.00 atm
zeropoint: 0.12535986 hartree
thermalvibcorrection: 0.00773679 hartree
thermalrotcorrection: 0.00141627 hartree
thermaltrasncorrection: 0.00141627 hartree
thermaltotal: -1026.12988365 hartree
thermalcorr: 0.01056934 hartree
nonthermalcorr: 0.12535986 hartree
totalcorr: 0.13592920 hartree
thermalcorrenthalpy: 0.00094421 hartree
totalenthalpy: -1026.12893944 hartree
totalentropycorr: -0.04679991 hartree
gibbsenthalpy: -1026.17573934 hartree
gibbsminuselec: 0.09007350 hartree
