program: Orca
programVersion: 5.0.2
elementType: Cl F F F O O O O O O O N N N C C C C C C C C C C C C C C C C C C C C C C H H H H H H H H H H H H H H H H H H
charge: 1
multiplicity: 1
keywords: wB97X-D3 TightOpt Freq def2-TZVPP def2/J RIJCOSX TightSCF defgrid3
frequency: 0.00 0.00 0.00 0.00 0.00 0.00 11.32 13.37 20.06 28.46 31.79 43.84 45.36 50.63 57.67 80.33 84.90 87.16 100.51 112.51 127.00 128.29 139.54 153.68 159.36 173.26 181.00 188.57 197.71 209.45 236.42 260.99 286.41 287.77 302.94 319.29 326.83 359.23 361.84 377.87 382.27 395.50 401.74 430.64 436.55 444.64 449.27 455.58 472.94 511.98 526.38 531.25 541.19 551.07 566.00 604.86 615.86 623.54 646.47 655.13 670.90 695.44 720.93 730.01 737.85 742.69 759.54 766.67 781.70 787.40 820.54 823.24 825.79 840.63 846.50 871.88 875.06 894.11 901.81 918.13 940.39 959.08 967.62 987.65 990.62 1004.57 1008.78 1016.47 1042.89 1076.63 1090.46 1104.05 1112.48 1131.69 1142.65 1151.63 1154.93 1181.63 1183.89 1187.24 1202.64 1209.43 1211.10 1216.04 1225.21 1234.65 1237.44 1240.96 1242.96 1267.55 1283.52 1288.98 1297.82 1307.64 1314.09 1316.36 1323.63 1338.02 1343.47 1350.20 1355.07 1397.41 1432.76 1483.84 1484.34 1484.98 1487.69 1492.30 1492.91 1494.52 1499.87 1502.75 1523.92 1530.72 1570.22 1579.13 1652.27 1674.35 1681.08 1684.37 1698.60 1746.45 1847.63 1888.84 3091.27 3094.35 3096.59 3129.45 3155.56 3179.93 3187.73 3196.10 3210.84 3214.07 3214.20 3221.02 3221.52 3229.18 3240.06 3240.58 3262.22 3553.19
frequency: 11.32 13.37 20.06 28.46 31.79 43.84 45.36 50.63 57.67 80.33 84.90 87.16 100.51 112.51 127.00 128.29 139.54 153.68 159.36 173.26 181.00 188.57 197.71 209.45 236.42 260.99 286.41 287.77 302.94 319.29 326.83 359.23 361.84 377.87 382.27 395.50 401.74 430.64 436.55 444.64 449.27 455.58 472.94 511.98 526.38 531.25 541.19 551.07 566.00 604.86 615.86 623.54 646.47 655.13 670.90 695.44 720.93 730.01 737.85 742.69 759.54 766.67 781.70 787.40 820.54 823.24 825.79 840.63 846.50 871.88 875.06 894.11 901.81 918.13 940.39 959.08 967.62 987.65 990.62 1004.57 1008.78 1016.47 1042.89 1076.63 1090.46 1104.05 1112.48 1131.69 1142.65 1151.63 1154.93 1181.63 1183.89 1187.24 1202.64 1209.43 1211.10 1216.04 1225.21 1234.65 1237.44 1240.96 1242.96 1267.55 1283.52 1288.98 1297.82 1307.64 1314.09 1316.36 1323.63 1338.02 1343.47 1350.20 1355.07 1397.41 1432.76 1483.84 1484.34 1484.98 1487.69 1492.30 1492.91 1494.52 1499.87 1502.75 1523.92 1530.72 1570.22 1579.13 1652.27 1674.35 1681.08 1684.37 1698.60 1746.45 1847.63 1888.84 3091.27 3094.35 3096.59 3129.45 3155.56 3179.93 3187.73 3196.10 3210.84 3214.07 3214.20 3221.02 3221.52 3229.18 3240.06 3240.58 3262.22 3553.19
formula: C22H18ClF3N3O7
InChI: InChI=1S/C22H18ClF3N3O7/c1-33-18(30)21-10-12-9-13(23)3-8-16(12)17(21)27-28(11-35-21)19(31)29(20(32)34-2)14-4-6-15(7-5-14)36-22(24,25)26/h3-9,31H,10-11H2,1-2H3
54 atoms
Cl 7.044169 -3.890877 -0.210427
F  -6.348682 -3.179212 0.677673
F  -8.352579 -2.51367 0.240367
F  -7.204536 -1.540197 1.783844
O  1.655098 0.941197 1.735926
O  4.753951 1.766446 0.133883
O  3.240691 3.075212 1.141672
O  -0.878633 -0.309714 -1.707915
O  -0.704978 3.29976 -0.808424
O  -2.768178 3.348898 0.092206
O  -6.72641 -1.248531 -0.377558
N  1.437981 -0.059142 -0.803866
N  0.467622 0.783722 -0.271147
N  -1.813112 1.35305 -0.490056
C  2.865625 0.682973 1.069875
C  3.775505 -0.287993 1.850383
C  2.558547 -0.095482 -0.193274
C  4.346024 -1.168369 0.765599
C  3.624652 -1.048712 -0.422494
C  3.630916 2.000732 0.785613
C  0.75302 1.611701 0.919241
C  5.407184 -2.046911 0.848975
C  3.937426 -1.805925 -1.543887
C  5.723533 -2.793644 -0.278865
C  5.001777 -2.680715 -1.468231
C  -0.720123 0.62555 -0.827508
C  5.585564 2.909468 -0.136358
C  -3.086423 0.664775 -0.450304
C  -1.828852 2.770197 -0.349471
C  -3.358846 -0.16082 0.621944
C  -4.010578 0.843208 -1.466115
C  -4.567023 -0.834908 0.692237
C  -5.219337 0.184477 -1.39983
C  -5.492338 -0.652886 -0.324387
C  -0.616648 4.736387 -0.705284
C  -7.147653 -2.113674 0.580662
H  4.534676 0.224878 2.437521
H  3.149017 -0.86329 2.533842
H  -0.17089 1.734446 1.478959
H  1.140389 2.574905 0.59856
H  5.982641 -2.163763 1.757158
H  3.375198 -1.702641 -2.462532
H  5.289177 -3.279065 -2.321214
H  5.046214 3.624693 -0.753469
H  5.881427 3.382202 0.797514
H  6.449754 2.519929 -0.662825
H  -2.635372 -0.27793 1.419033
H  -3.790956 1.495515 -2.30091
H  -4.770239 -1.475936 1.535602
H  -5.965122 0.304583 -2.173038
H  -1.404054 5.195883 -1.297181
H  -0.710541 5.040992 0.334598
H  0.361752 4.99202 -1.097231
H  -0.02122 -0.776793 -1.788146
totalener: -2299.72312588 hartree
nucrepener: 4109.87104471 hartree
electener: -6409.59417060 hartree
twoeener: 4893.68608713 hartree
kineticenergy: 2291.95726119 hartree
xcener: -187.257704285381 hartree
chargesum: 1.0000000
charge: -0.009000 -0.162206 -0.132615 -0.159239 -0.299284 -0.258492 -0.324323 -0.199073 -0.302600 -0.275540 -0.256320 -0.333911 0.100041 -0.098860 0.514872 -0.202766 0.158756 -0.073622 -0.064923 0.265645 -0.011747 -0.117062 -0.169229 0.093737 -0.103546 0.409512 -0.130523 0.103368 0.396524 -0.223859 -0.154847 -0.063673 -0.103565 0.238917 -0.132210 0.573086 0.119824 0.116240 0.148213 0.162075 0.135837 0.142757 0.138949 0.117196 0.126770 0.130289 0.127223 0.128715 0.125065 0.144573 0.140273 0.133844 0.129084 0.241650
charge: 0.462843 0.209371 0.248400 0.212844 0.296946 0.319917 0.151750 0.462520 0.293034 0.174109 0.331463 0.138208 0.243490 0.285962 -0.222524 0.057989 -0.124140 -0.027825 -0.071785 -0.451747 -0.116465 -0.004525 0.037974 -0.370940 -0.010965 -0.307187 0.001430 -0.133165 -0.544248 0.012285 0.023182 0.008541 0.027456 -0.165716 0.004795 -0.823163 0.040467 0.047202 0.036406 0.012007 0.033574 0.033081 0.032510 0.013006 0.016047 0.016141 0.030657 0.036045 0.027724 0.038531 0.019579 0.017252 0.015657 -0.095999
qa: -0.0090 -0.1622 -0.1326 -0.1592 -0.2993 -0.2585 -0.3243 -0.1991 -0.3026 -0.2755 -0.2563 -0.3339 0.1000 -0.0989 0.5149 -0.2028 0.1588 -0.0736 -0.0649 0.2656 -0.0117 -0.1171 -0.1692 0.0937 -0.1035 0.4095 -0.1305 0.1034 0.3965 -0.2239 -0.1548 -0.0637 -0.1036 0.2389 -0.1322 0.5731 0.1198 0.1162 0.1482 0.1621 0.1358 0.1428 0.1389 0.1172 0.1268 0.1303 0.1272 0.1287 0.1251 0.1446 0.1403 0.1338 0.1291 0.2417
va: 1.3015 1.1449 1.1888 1.1486 2.0944 2.1856 2.1643 2.3299 2.1081 2.2299 2.1735 2.8949 3.2152 3.1269 3.7686 3.9811 3.8324 3.8667 3.7715 4.2332 4.0087 4.0191 4.0513 4.0343 4.0010 4.1830 3.8666 3.6170 4.2984 4.2014 4.1679 3.9662 4.0175 3.9382 3.8401 4.6160 1.0073 1.0168 0.9897 0.9819 1.0157 1.0103 1.0113 0.9938 0.9915 0.9935 1.0152 1.0126 1.0334 1.0080 0.9942 0.9902 0.9915 1.0488
dispcorr: -0.030025331 hartree
energy: -2299.753215472672
dipole: 31.99863 -29.03746 2.96117 32.24118 -30.73703 1.50415 -4.21822 3.20488 -1.01334
magnitude: 3.47244 au
magnitude: 8.82624 debye
temp: 298.15 k
press: 1.00 atm
zeropoint: 0.39665167 hartree
thermalvibcorrection: 0.02883703 hartree
thermalrotcorrection: 0.00141627 hartree
thermaltrasncorrection: 0.00141627 hartree
thermaltotal: -2299.32489424 hartree
thermalcorr: 0.03166957 hartree
nonthermalcorr: 0.39665167 hartree
totalcorr: 0.42832124 hartree
thermalcorrenthalpy: 0.00094421 hartree
totalenthalpy: -2299.32395003 hartree
totalentropycorr: -0.09242959 hartree
gibbsenthalpy: -2299.41637961 hartree
gibbsminuselec: 0.33683586 hartree
