program: Gaussian 09
title: 000005241
version: EM64L-G09RevD.01
frameworkgroup: C1[X(C12H13I3N2O2)]
method: RPBEPBE
basis: SDD
operation: Freq
keyword: #p
keyword: freq=noraman
keyword: PBEPBE/SDD
title: #p freq=noraman PBEPBE/SDD
converged: NO YES NO NO
title: Mulliken charges:
elementType: I I I O O N N C C C C C C C C C C C C H H H H H H H H H H H H H
charge: 0.102852 0.102626 0.107151 -0.414859 -0.229493 -0.133572 -0.068159 -0.645213 0.735803 -0.454353 -0.723534 -0.587276 0.541012 -0.090873 -0.528305 0.191770 -0.136056 -0.620805 -0.583606 0.268158 0.273793 0.275526 0.275334 0.271979 0.247086 0.228488 0.295392 0.226205 0.234274 0.227804 0.234688 0.376163
chargesum: 0.00000
title: Mulliken charges with hydrogens summed into heavy atoms:
elementType: I I I O O N N C C C C C C C C C C C C
charge: 0.102852 0.102626 0.107151 -0.038697 -0.229493 -0.133572 -0.068159 -0.103262 0.735803 0.096507 -0.723534 -0.587276 0.541012 0.181106 -0.528305 0.191770 0.111030 0.129280 0.113159
polarizability: 3.45975673e+02 -2.16346325e+01 2.67703666e+02 -1.22370434e+01 -5.73113946e+00 1.18095806e+02
1716.lowfreq: -8.3675 0.0005 0.0005 0.0006 2.8738 5.2290 20.5855 22.6732 22.8056
frequency: 20.3937 22.6634 22.7526 29.4082 32.2928 45.9122 76.2219 85.4770 93.5411 101.3252 106.0396 112.3739 128.1925 141.0995 154.6313 158.8657 178.9951 207.7686 249.4780 266.2518 297.7463 309.0751 356.4694 362.1649 391.8692 407.8626 435.6233 493.5597 503.7343 510.1176 552.2142 575.1937 625.7514 633.6759 662.8813 668.0413 740.5502 765.8047 779.5076 863.1262 873.6607 880.4352 952.3316 958.2813 999.4338 1014.2420 1027.6230 1060.0434 1080.7271 1093.1483 1097.2855 1145.4380 1153.3622 1206.5223 1221.5939 1238.0262 1244.9790 1273.0140 1282.9827 1305.5666 1332.2255 1372.0542 1375.8703 1388.8018 1420.5190 1434.3169 1434.8468 1453.0087 1459.3807 1470.5770 1476.7818 1484.3014 1496.9275 1516.7050 1544.0625 1662.7482 1669.0521 2963.3867 2971.1760 3000.3181 3027.3060 3028.2000 3037.2026 3047.8804 3051.1868 3089.0393 3093.4485 3117.8319 3182.4319 3513.1410
redmass: 6.6088 8.9448 12.1320 9.4165 4.3185 3.3932 8.3009 13.6361 3.4058 2.0502 2.4099 5.9021 1.0831 5.5243 11.4927 79.5464 5.7243 2.0279 6.8377 5.0796 3.8101 6.6234 3.4266 4.1338 4.2594 3.1465 5.0660 3.2269 2.0978 4.0533 5.0593 5.5922 6.8662 1.3390 8.6128 8.4903 7.7890 7.2584 1.4231 4.0901 1.5177 3.5627 1.4454 3.7253 8.2711 2.6816 3.0644 1.3833 2.5036 1.7398 1.2585 1.3764 1.3795 1.9866 2.8945 3.5369 1.4597 1.4994 3.0523 1.6627 2.7589 1.7470 2.0081 2.3731 1.1525 1.4351 1.1024 1.4974 1.0422 1.0983 1.1720 1.0467 3.3370 1.9121 8.6539 6.6653 8.2554 1.0351 1.0356 1.0606 1.0897 1.0610 1.1018 1.1016 1.0986 1.1016 1.0985 1.0982 1.0931 1.0640
irintensity: 0.8970 0.5845 0.4168 0.6453 2.0984 0.2154 0.6551 0.0629 0.1019 0.0919 0.6661 3.1072 0.1455 0.0574 1.3556 0.1308 3.0118 1.4556 0.9501 1.8621 2.3134 1.4670 10.2174 16.5534 4.0013 1.5978 26.1215 32.7438 14.4946 5.0593 15.7930 2.2747 15.0796 108.0540 29.7368 29.4425 21.7925 16.5102 26.7869 0.0831 11.5016 0.9434 13.4002 17.7519 15.0461 77.9797 181.0037 7.5171 92.8430 240.7348 18.7780 0.9438 10.9212 11.6994 3.6456 33.9510 1.0379 37.6374 49.4464 59.7694 32.9011 74.5491 11.3289 142.2396 22.8343 2.1336 22.7569 45.3213 7.7357 28.8670 27.5816 18.7988 12.6647 18.3417 52.0756 1252.4738 188.8215 74.2107 118.2348 11.5490 39.1869 7.7054 35.1329 22.5504 0.6126 3.4997 23.6866 1.2029 0.0429 21.2244
temp: 298.150 k
press: 1.00000 atm
elementType: 53 53 53 8 8 7 7 6 6 6 6 6 6 6 6 6 6 6 6 1 1 1 1 1 1 1 1 1 1 1 1 1
symmnumber: 1
zpe: 600478.0 jmol-1
zpe.correction: 0.228710 hartree
zpe.thermalcorrener: 0.250968 hartree
zpe.thermalcorrenthalpy: 0.251912 hartree
zpe.thermalcorrgfe: 0.169736 hartree
zpe.sumelectzpe: -758.128070 hartree
zpe.sumelectthermal: -758.105812 hartree
zpe.sumelectthermalent: -758.104868 hartree
zpe.sumelectthermalfe: -758.187044 hartree
dipole: -5.1791 1.7407 3.4008
dipole: 6.4357
quadrupole: -126.4869 -150.7522 -157.5873
quadrupole: -11.4010 0.3161 4.9760
quadrupole: 18.4552 -5.8101 -12.6452 -11.4010 0.3161 4.9760
hfenergy: -758.3567801 hartree
pointgroup: C01 [X(C12H13I3N2O2)]
dipole: -1.9206135 1.0203197 1.2966502 debye
polarizability: 341.9106825|-29.1823423|261.7166366|-22.4571254|-32.249763|128.1478258 unknown
InChI: InChI=1S/C12H13I3N2O2/c1-17(2)6-16-12-9(14)5-8(13)7(11(12)15)3-4-10(18)19/h5-6,18H,3-4H2,1-2H3
charge 0 multiplicity 1
32 atoms
I  0.063006 2.237869 -1.060206
I  2.917989 -3.196246 0.203868
I  -3.087011 -2.750129 0.778209
O  5.220656 1.911545 1.227802
O  5.174542 1.360206 -1.027635
N  -2.377314 0.383755 -0.306341
N  -4.372751 1.388918 0.444977
C  2.615221 0.048291 -0.779509
C  1.279889 -0.572259 -0.409167
C  3.293541 0.701866 0.447731
C  0.06034 0.156795 -0.462723
C  1.175935 -1.921923 0.034245
C  -1.226364 -0.378897 -0.1197
C  -0.056237 -2.508924 0.385066
C  -1.234706 -1.74481 0.306545
C  4.626043 1.329408 0.094954
C  -3.194705 0.722517 0.664982
C  -4.815637 1.716975 -0.918824
C  -5.248183 1.778922 1.556278
H  3.289763 -0.719981 -1.193862
H  2.483667 0.811011 -1.564472
H  2.648242 1.487627 0.884115
H  3.464206 -0.040688 1.250066
H  -0.099237 -3.550689 0.707579
H  -2.984121 0.520881 1.729775
H  -5.764366 1.197667 -1.155046
H  -4.035671 1.389595 -1.622444
H  -4.971607 2.807434 -1.022036
H  -5.400247 2.875457 1.571186
H  -4.799419 1.476909 2.517277
H  -6.238765 1.292201 1.466409
H  6.092401 2.314898 0.964899
