program: Orca
programVersion: 5.0.2
elementType: S F F F F O O N N N C C C C C C C C C C C C C C H H H H H H H H H H H H H H
charge: 1
multiplicity: 1
keywords: wB97X-D3 TightOpt Freq def2-TZVPP def2/J RIJCOSX TightSCF defgrid3
frequency: 0.00 0.00 0.00 0.00 0.00 0.00 7.16 9.01 13.52 33.44 43.61 54.03 76.22 85.49 113.53 128.35 131.22 152.17 187.37 205.82 243.13 254.63 267.60 282.78 299.39 314.98 323.36 369.36 382.54 407.11 424.85 440.17 441.78 451.89 477.11 509.63 542.61 548.87 560.23 595.98 606.18 616.19 643.78 662.08 668.05 688.20 758.96 762.48 773.17 791.76 820.57 855.09 857.48 879.93 894.64 946.57 959.20 966.82 987.85 995.57 1007.16 1013.78 1021.95 1043.47 1060.92 1083.39 1129.51 1145.69 1160.84 1170.56 1186.97 1216.33 1224.59 1268.19 1282.18 1298.67 1307.60 1316.13 1316.99 1326.84 1343.11 1372.79 1389.76 1420.13 1421.70 1432.66 1441.42 1467.93 1488.44 1489.90 1496.71 1508.71 1511.36 1519.70 1574.88 1638.97 1641.89 1673.34 1691.32 1720.89 2797.86 3066.04 3071.47 3100.27 3135.80 3147.17 3153.68 3155.79 3162.64 3215.74 3217.80 3225.68 3239.37 3239.61
frequency: 7.16 9.01 13.52 33.44 43.61 54.03 76.22 85.49 113.53 128.35 131.22 152.17 187.37 205.82 243.13 254.63 267.60 282.78 299.39 314.98 323.36 369.36 382.54 407.11 424.85 440.17 441.78 451.89 477.11 509.63 542.61 548.87 560.23 595.98 606.18 616.19 643.78 662.08 668.05 688.20 758.96 762.48 773.17 791.76 820.57 855.09 857.48 879.93 894.64 946.57 959.20 966.82 987.85 995.57 1007.16 1013.78 1021.95 1043.47 1060.92 1083.39 1129.51 1145.69 1160.84 1170.56 1186.97 1216.33 1224.59 1268.19 1282.18 1298.67 1307.60 1316.13 1316.99 1326.84 1343.11 1372.79 1389.76 1420.13 1421.70 1432.66 1441.42 1467.93 1488.44 1489.90 1496.71 1508.71 1511.36 1519.70 1574.88 1638.97 1641.89 1673.34 1691.32 1720.89 2797.86 3066.04 3071.47 3100.27 3135.80 3147.17 3153.68 3155.79 3162.64 3215.74 3217.80 3225.68 3239.37 3239.61
formula: C14H14F4N3O2S
InChI: InChI=1S/C14H14F4N3O2S/c1-8(2)21(10-5-3-9(15)4-6-10)11(22)7-23-13-20-19-12(24-13)14(16,17)18/h3-6,8,20H,7H2,1-2H3
38 atoms
S  -3.157565 -1.483484 0.473166
F  5.994748 -2.936071 -0.114828
F  -6.149676 0.71256 -0.80827
F  -6.06783 -1.367459 -0.211466
F  -6.004452 0.19033 1.282309
O  -0.573216 -0.978741 0.262806
O  0.127588 1.805462 -0.254311
N  2.257068 1.111742 0.053996
N  -2.127672 0.640662 -0.363275
N  -3.445836 0.891528 -0.443925
C  2.716573 2.509496 0.305132
C  3.231252 0.054374 0.008634
C  3.319037 3.105128 -0.959326
C  3.669124 2.569598 1.487267
C  0.973555 0.902878 -0.223863
C  0.526818 -0.519635 -0.570821
C  3.873139 -0.244034 -1.185905
C  3.53323 -0.656784 1.162977
C  4.813923 -1.2595 -1.234339
C  4.469648 -1.67449 1.126265
C  5.095591 -1.957724 -0.074893
C  -1.782993 -0.542929 0.096047
C  -4.107553 -0.125839 -0.035895
C  -5.627197 -0.135881 0.050713
H  1.808847 3.0541 0.553356
H  3.553406 4.155185 -0.788683
H  4.246187 2.601058 -1.235452
H  2.620673 3.050298 -1.794736
H  3.223272 2.146991 2.387564
H  3.903064 3.613489 1.69187
H  4.607553 2.053325 1.284013
H  0.202338 -0.537645 -1.613033
H  1.291941 -1.268699 -0.413889
H  3.635644 0.31563 -2.081494
H  3.03262 -0.414055 2.091277
H  5.327064 -1.512687 -2.151599
H  4.722162 -2.244035 2.009819
H  -1.360747 1.363444 -0.498192
totalener: -1654.09876746 hartree
nucrepener: 2252.11406634 hartree
electener: -3906.21283380 hartree
oneelecener: -6725.50206398 hartree
twoeener: 2819.28923017 hartree
kineticenergy: 1648.64928904 hartree
xcener: -131.291065938532 hartree
chargesum: 1.0000000
charge: 0.212268 -0.170529 -0.113457 -0.144694 -0.129616 -0.220381 -0.449335 -0.000683 0.053398 -0.162546 0.110063 -0.060720 -0.286005 -0.265208 0.319559 -0.049242 -0.216359 -0.199958 -0.105649 -0.092679 0.273773 0.297564 0.039291 0.488854 0.093271 0.112917 0.093050 0.102362 0.094250 0.114629 0.104652 0.165252 0.156505 0.154957 0.141043 0.148355 0.147864 0.243183
charge: 0.883846 0.226675 0.268658 0.225906 0.239292 0.341341 0.141786 0.316765 0.317920 0.147129 -0.099751 -0.153674 0.024041 0.025542 -0.359224 -0.006658 0.001014 0.003823 0.013538 0.013371 -0.215946 -0.517553 -0.418054 -0.714069 0.029959 0.028803 0.017747 0.017616 0.016877 0.029729 0.021272 0.037888 0.035637 0.032763 0.032732 0.037390 0.037355 -0.081485
qa: 0.2123 -0.1705 -0.1135 -0.1447 -0.1296 -0.2204 -0.4493 -0.0007 0.0534 -0.1625 0.1101 -0.0607 -0.2860 -0.2652 0.3196 -0.0492 -0.2164 -0.2000 -0.1056 -0.0927 0.2738 0.2976 0.0393 0.4889 0.0933 0.1129 0.0931 0.1024 0.0943 0.1146 0.1047 0.1653 0.1565 0.1550 0.1410 0.1484 0.1479 0.2432
va: 2.7624 1.1320 1.2197 1.1714 1.1879 2.2178 2.0732 3.1281 3.3680 2.9743 3.7673 3.6422 3.9435 3.9212 4.0441 3.8188 4.0052 4.0197 3.9165 3.8998 4.0351 4.1670 4.0307 4.4888 1.0202 1.0122 1.0001 1.0043 1.0072 1.0103 0.9949 0.9852 0.9983 1.0026 1.0143 1.0029 1.0022 1.0791
dispcorr: -0.018529619 hartree
energy: -1654.117291944555
dipole: 50.96292 -50.34199 0.62093 19.13099 -19.45546 -0.32447 -0.84571 0.69743 -0.14828
magnitude: 0.71612 au
magnitude: 1.82023 debye
temp: 298.15 k
press: 1.00 atm
zeropoint: 0.28082937 hartree
thermalvibcorrection: 0.01922672 hartree
thermalrotcorrection: 0.00141627 hartree
thermaltrasncorrection: 0.00141627 hartree
thermaltotal: -1653.81440331 hartree
thermalcorr: 0.02205926 hartree
nonthermalcorr: 0.28082937 hartree
totalcorr: 0.30288863 hartree
thermalcorrenthalpy: 0.00094421 hartree
totalenthalpy: -1653.81345910 hartree
totalentropycorr: -0.07360218 hartree
gibbsenthalpy: -1653.88706128 hartree
gibbsminuselec: 0.23023066 hartree
