program: Orca
programVersion: 5.0.2
elementType: Cl Cl S F F F F F F O N N N N C C C C C C C C C C C C H H H H H
charge: 1
multiplicity: 1
keywords: wB97X-D3 TightOpt Freq def2-TZVPP def2/J RIJCOSX TightSCF defgrid3
frequency: 0.00 0.00 0.00 0.00 0.00 0.00 5.02 12.80 17.08 27.10 42.24 51.15 65.92 96.00 101.90 110.59 120.65 137.00 162.10 177.39 201.36 203.21 209.29 227.88 251.93 262.74 295.07 299.69 307.42 320.14 347.30 356.40 378.47 388.11 411.70 450.34 464.06 473.53 479.46 489.17 513.47 533.85 554.77 558.93 559.97 576.27 615.41 624.64 630.60 663.52 688.95 701.50 726.54 765.13 772.61 779.05 830.80 848.26 891.79 947.48 957.21 1053.92 1081.24 1126.87 1134.51 1169.29 1182.19 1182.66 1212.68 1234.49 1244.41 1246.69 1280.12 1296.82 1301.73 1314.69 1321.23 1350.56 1454.28 1489.53 1537.60 1564.05 1592.85 1622.41 1644.32 1678.98 1717.10 2427.52 3242.94 3243.44 3534.24 3666.07 3715.42
frequency: 5.02 12.80 17.08 27.10 42.24 51.15 65.92 96.00 101.90 110.59 120.65 137.00 162.10 177.39 201.36 203.21 209.29 227.88 251.93 262.74 295.07 299.69 307.42 320.14 347.30 356.40 378.47 388.11 411.70 450.34 464.06 473.53 479.46 489.17 513.47 533.85 554.77 558.93 559.97 576.27 615.41 624.64 630.60 663.52 688.95 701.50 726.54 765.13 772.61 779.05 830.80 848.26 891.79 947.48 957.21 1053.92 1081.24 1126.87 1134.51 1169.29 1182.19 1182.66 1212.68 1234.49 1244.41 1246.69 1280.12 1296.82 1301.73 1314.69 1321.23 1350.56 1454.28 1489.53 1537.60 1564.05 1592.85 1622.41 1644.32 1678.98 1717.10 2427.52 3242.94 3243.44 3534.24 3666.07 3715.42
formula: C12H5Cl2F6N4OS
InChI: InChI=1S/C12H5Cl2F6N4OS/c13-5-1-4(11(15,16)17)2-6(14)8(5)24-10(22)9(7(3-21)23-24)26(25)12(18,19)20/h1-2,23H,22H2
31 atoms
Cl -1.309631 2.707423 -0.689352
Cl -0.820501 -2.317116 1.173446
S  3.887516 0.642417 -0.920764
F  -6.112844 0.763361 -0.000909
F  -5.708028 -0.820322 -1.411317
F  -5.922326 -1.273936 0.689053
F  3.537473 -1.986612 -0.679063
F  4.578493 -1.03674 0.967508
F  5.579237 -1.334282 -0.931087
O  3.512575 0.505088 -2.335475
N  0.166774 0.3560 0.342971
N  0.738874 0.909384 1.448562
N  0.87937 -0.327265 -1.795559
N  3.609044 2.037865 3.021155
C  -1.237094 0.173789 0.230467
C  1.116587 0.165256 -0.594419
C  2.347606 0.595488 -0.032968
C  2.049702 1.053515 1.231249
C  -2.033073 1.216148 -0.248891
C  -1.811972 -1.046299 0.588373
C  -3.955669 -0.176594 -0.002545
C  -3.399043 1.03986 -0.364838
C  -3.179347 -1.221887 0.470724
C  -5.451729 -0.379304 -0.177173
C  4.431519 -1.065226 -0.351443
C  2.912023 1.596601 2.225314
H  -4.018485 1.847227 -0.729012
H  -3.628476 -2.163564 0.75306
H  1.645339 -0.316691 -2.458225
H  -0.051733 -0.548942 -2.100719
H  0.20519 1.054064 2.291106
totalener: -2672.06155814 hartree
nucrepener: 3007.98789589 hartree
electener: -5680.04945403 hartree
oneelecener: -9641.53215481 hartree
twoeener: 3961.48270078 hartree
kineticenergy: 2665.26710951 hartree
xcener: -177.703486334757 hartree
chargesum: 1.0000000
charge: 0.033910 0.035014 0.554495 -0.150108 -0.144990 -0.149797 -0.136687 -0.135856 -0.109191 -0.490575 0.078529 -0.016046 -0.195033 0.111616 -0.141563 0.177833 -0.110228 0.321032 -0.022549 0.002967 -0.053572 -0.037002 -0.036254 0.543795 0.422866 -0.271868 0.150424 0.151269 0.226871 0.181104 0.209593
charge: 0.496809 0.494714 0.837266 0.230243 0.223239 0.231140 0.226721 0.225696 0.252906 -0.315417 0.291124 0.401167 0.424905 0.182171 -0.212031 -0.199808 -0.282065 -0.160652 -0.386867 -0.387191 -0.050405 0.018311 0.018625 -0.648524 -0.866595 -0.138645 0.046106 0.045707 -0.015455 -0.005609 0.022412
qa: 0.0339 0.0350 0.5545 -0.1501 -0.1450 -0.1498 -0.1367 -0.1359 -0.1092 -0.4906 0.0785 -0.0160 -0.1950 0.1116 -0.1416 0.1778 -0.1102 0.3210 -0.0225 0.0030 -0.0536 -0.0370 -0.0363 0.5438 0.4229 -0.2719 0.1504 0.1513 0.2269 0.1811 0.2096
va: 1.3612 1.3614 3.6842 1.1667 1.1639 1.1676 1.1830 1.1830 1.2217 1.9461 3.2958 3.3786 3.3599 3.0455 3.5133 4.2374 3.7495 3.9712 4.1527 4.1246 3.8756 3.9530 3.9445 4.4230 4.4544 3.9644 1.0192 1.0187 1.0258 1.0177 1.0003
dispcorr: -0.019196448 hartree
energy: -2672.080796796993
dipole: 1.08774 -1.45548 -0.36774 4.62745 -4.30342 0.32403 -1.48023 1.82168 0.34145
magnitude: 0.59734 au
magnitude: 1.51831 debye
temp: 298.15 k
press: 1.00 atm
zeropoint: 0.17667150 hartree
thermalvibcorrection: 0.02147525 hartree
thermalrotcorrection: 0.00141627 hartree
thermaltrasncorrection: 0.00141627 hartree
thermaltotal: -2671.87981751 hartree
thermalcorr: 0.02430779 hartree
nonthermalcorr: 0.17667150 hartree
totalcorr: 0.20097929 hartree
thermalcorrenthalpy: 0.00094421 hartree
totalenthalpy: -2671.87887330 hartree
totalentropycorr: -0.07823699 hartree
gibbsenthalpy: -2671.95711029 hartree
gibbsminuselec: 0.12368651 hartree
