program: Orca
programVersion: 5.0.2
elementType: S P O O O O O N C C C C C C C C C C C C C H H H H H H H H H H H H H H H H H H H H H H H
charge: 1
multiplicity: 1
keywords: wB97X-D3 TightOpt Freq def2-TZVPP def2/J RIJCOSX TightSCF defgrid3
frequency: 0.00 0.00 0.00 0.00 0.00 0.00 14.17 20.22 22.88 26.39 29.06 51.62 63.44 78.20 90.86 108.27 126.16 139.32 177.46 196.71 202.18 212.15 214.10 231.85 237.04 257.70 265.65 281.69 300.95 312.43 330.16 346.55 362.72 364.47 406.34 412.36 432.24 452.98 460.97 466.65 484.84 506.65 516.47 527.61 550.95 570.78 610.08 650.76 729.62 743.81 778.60 789.93 825.46 845.43 865.26 903.95 910.61 938.47 944.80 964.45 968.75 976.32 977.58 1014.07 1019.54 1027.79 1033.36 1066.59 1073.73 1098.64 1106.32 1130.42 1152.10 1160.55 1164.85 1171.64 1186.63 1190.60 1203.20 1217.13 1261.33 1300.14 1320.78 1322.81 1354.98 1358.61 1362.71 1414.76 1416.28 1424.33 1429.25 1441.11 1441.43 1450.08 1454.69 1461.09 1464.62 1483.80 1485.79 1489.29 1493.31 1498.71 1504.45 1510.37 1512.32 1521.44 1532.28 1656.22 1684.50 3062.77 3064.64 3079.35 3083.09 3086.15 3086.22 3087.96 3139.81 3145.22 3147.16 3157.87 3160.33 3162.26 3163.27 3173.39 3173.53 3188.91 3204.35 3219.70 3221.04 3235.98 3617.33 3865.16
frequency: 14.17 20.22 22.88 26.39 29.06 51.62 63.44 78.20 90.86 108.27 126.16 139.32 177.46 196.71 202.18 212.15 214.10 231.85 237.04 257.70 265.65 281.69 300.95 312.43 330.16 346.55 362.72 364.47 406.34 412.36 432.24 452.98 460.97 466.65 484.84 506.65 516.47 527.61 550.95 570.78 610.08 650.76 729.62 743.81 778.60 789.93 825.46 845.43 865.26 903.95 910.61 938.47 944.80 964.45 968.75 976.32 977.58 1014.07 1019.54 1027.79 1033.36 1066.59 1073.73 1098.64 1106.32 1130.42 1152.10 1160.55 1164.85 1171.64 1186.63 1190.60 1203.20 1217.13 1261.33 1300.14 1320.78 1322.81 1354.98 1358.61 1362.71 1414.76 1416.28 1424.33 1429.25 1441.11 1441.43 1450.08 1454.69 1461.09 1464.62 1483.80 1485.79 1489.29 1493.31 1498.71 1504.45 1510.37 1512.32 1521.44 1532.28 1656.22 1684.50 3062.77 3064.64 3079.35 3083.09 3086.15 3086.22 3087.96 3139.81 3145.22 3147.16 3157.87 3160.33 3162.26 3163.27 3173.39 3173.53 3188.91 3204.35 3219.70 3221.04 3235.98 3617.33 3865.16
formula: C13H23NO5PS
InChI: InChI=1S/C13H23NO5PS/c1-6-18-20(15,14-10(2)3)19-12-7-8-13(11(4)9-12)21(5,16)17/h7-10,14-15H,6H2,1-5H3
44 atoms
S  4.460628 -0.019409 -0.55674
P  -2.427774 -0.34838 0.576183
O  -1.27751 -1.310599 0.172483
O  -3.742204 -1.105272 0.306122
O  -2.476985 -0.056551 2.105244
O  5.233105 -0.810012 0.350639
O  4.640925 -0.147126 -1.970976
N  -2.225648 1.031178 -0.190637
C  -3.042874 2.252079 0.023539
C  2.724738 -0.340509 -0.234401
C  2.212009 -0.518337 1.05917
C  0.081028 -0.949474 0.038245
C  -3.682842 2.675045 -1.288644
C  -2.187199 3.34215 0.647193
C  0.857234 -0.820721 1.170862
C  1.923587 -0.477337 -1.357851
C  0.57964 -0.791314 -1.235312
C  3.036466 -0.439325 2.312392
C  4.676783 1.686866 -0.149405
C  -4.105908 -1.644199 -1.011204
C  -5.585377 -1.910142 -1.01465
H  -3.829126 1.969275 0.727658
H  -1.428397 1.121526 -0.803343
H  -4.307127 3.554177 -1.134669
H  -2.92144 2.933546 -2.027196
H  -4.308028 1.882648 -1.700009
H  -1.753595 3.011783 1.590401
H  -2.790334 4.228751 0.838574
H  -1.377223 3.629725 -0.026428
H  0.418112 -0.980811 2.146899
H  2.37329 -0.362477 -2.334845
H  -0.047287 -0.941541 -2.104193
H  2.400359 -0.519569 3.191201
H  3.774965 -1.238677 2.333161
H  3.589243 0.496364 2.381302
H  5.72718 1.899803 -0.343872
H  4.045921 2.291113 -0.79634
H  4.453768 1.857785 0.900286
H  -3.820009 -0.90653 -1.762802
H  -3.518658 -2.550092 -1.151642
H  -5.866783 -2.328913 -1.980694
H  -5.854489 -2.627214 -0.240943
H  -6.150909 -0.99225 -0.861191
H  -2.970049 -0.676095 2.652272
totalener: -1679.64757077 hartree
nucrepener: 2179.53138374 hartree
electener: -3859.17895451 hartree
oneelecener: -6614.70603253 hartree
twoeener: 2755.52707802 hartree
kineticenergy: 1674.18470411 hartree
xcener: -125.421703169777 hartree
chargesum: 1.0000000
charge: 0.829284 0.798280 -0.283307 -0.284961 -0.276060 -0.446930 -0.460075 -0.183447 0.014336 -0.179614 0.024461 0.233376 -0.216258 -0.215861 -0.114196 0.010969 -0.281470 -0.223137 -0.273629 -0.030202 -0.200949 0.075575 0.173455 0.107672 0.091603 0.087154 0.099240 0.104947 0.085907 0.116256 0.163138 0.156379 0.085050 0.143477 0.109151 0.144692 0.122626 0.118858 0.109913 0.138882 0.100463 0.099385 0.087973 0.237596
charge: 0.741938 0.295137 0.194990 0.138137 0.243160 -0.240646 -0.243905 0.181966 -0.147284 -0.193335 -0.059878 -0.197440 0.019718 0.021079 0.005928 0.010162 -0.018758 0.035630 -0.091744 -0.070976 0.018292 0.028127 -0.027937 0.029619 0.020791 0.014288 0.018413 0.028710 0.019620 0.030478 0.035597 0.030134 0.021716 0.036763 0.021393 0.022112 0.009530 0.002659 0.011230 0.021156 0.032026 0.023955 0.019994 -0.092546
qa: 0.8293 0.7983 -0.2833 -0.2850 -0.2761 -0.4469 -0.4601 -0.1834 0.0143 -0.1796 0.0245 0.2334 -0.2163 -0.2159 -0.1142 0.0110 -0.2815 -0.2231 -0.2736 -0.0302 -0.2009 0.0756 0.1735 0.1077 0.0916 0.0872 0.0992 0.1049 0.0859 0.1163 0.1631 0.1564 0.0850 0.1435 0.1092 0.1447 0.1226 0.1189 0.1099 0.1389 0.1005 0.0994 0.0880 0.2376
va: 5.6699 5.5478 2.1877 2.1912 2.3027 2.0256 2.0396 3.1389 3.9059 3.9444 3.8521 3.6774 3.9320 3.9292 4.0594 3.8833 4.0268 3.9293 3.9004 3.8279 3.9608 1.0099 1.0219 1.0102 1.0071 1.0076 1.0099 1.0102 1.0078 1.0238 1.0213 1.0008 1.0066 0.9974 0.9984 1.0162 1.0126 1.0096 0.9912 0.9892 1.0077 1.0049 1.0074 1.0240
dispcorr: -0.022205044 hartree
energy: -1679.669867337802
dipole: -21.84523 16.85418 -4.99105 14.85720 -13.71684 1.14036 -0.94457 1.70482 0.76025
magnitude: 5.17581 au
magnitude: 13.15586 debye
temp: 298.15 k
press: 1.00 atm
zeropoint: 0.36421353 hartree
thermalvibcorrection: 0.02186467 hartree
thermalrotcorrection: 0.00141627 hartree
thermaltrasncorrection: 0.00141627 hartree
thermaltotal: -1679.28095660 hartree
thermalcorr: 0.02469721 hartree
nonthermalcorr: 0.36421353 hartree
totalcorr: 0.38891074 hartree
thermalcorrenthalpy: 0.00094421 hartree
totalenthalpy: -1679.28001239 hartree
totalentropycorr: -0.07726125 hartree
gibbsenthalpy: -1679.35727363 hartree
gibbsminuselec: 0.31259370 hartree
