program: Orca
programVersion: 5.0.2
elementType: Cl O O O O N C C C C C C C C C C C C C C C C C C C C C H H H H H H H H H H H H H H H H H H H H H H H
charge: 1
multiplicity: 1
keywords: wB97X-D3 TightOpt Freq def2-TZVPP def2/J RIJCOSX TightSCF defgrid3
frequency: 0.00 0.00 0.00 0.00 0.00 0.00 18.20 24.01 32.74 36.72 38.54 62.35 67.76 92.14 101.77 113.77 135.86 154.33 166.04 171.31 189.79 201.34 220.04 223.43 241.05 270.97 289.28 303.12 322.01 335.20 350.49 371.94 379.74 392.97 423.73 427.26 446.99 465.88 473.31 482.28 486.98 509.08 530.39 563.47 596.38 616.70 620.10 648.17 656.06 682.24 709.79 719.81 753.77 769.22 775.18 801.67 823.24 846.19 860.82 861.67 866.43 872.47 893.00 896.85 912.20 951.68 985.92 1004.98 1014.51 1023.61 1030.77 1033.90 1048.88 1074.50 1075.05 1095.69 1099.23 1140.87 1144.29 1145.13 1181.43 1182.78 1183.15 1186.06 1190.66 1213.92 1215.28 1217.74 1219.21 1231.06 1258.61 1272.80 1304.95 1311.29 1312.31 1318.41 1333.19 1336.57 1342.28 1352.63 1375.74 1382.83 1403.09 1403.81 1414.64 1439.35 1451.89 1472.37 1481.88 1487.12 1496.15 1499.48 1502.57 1503.37 1504.22 1505.60 1509.80 1510.41 1513.26 1547.13 1572.31 1602.15 1638.35 1640.98 1651.73 1672.55 1680.69 3017.65 3021.10 3032.51 3050.59 3081.70 3083.42 3100.60 3126.07 3148.89 3151.86 3153.32 3183.65 3190.00 3191.36 3197.25 3215.28 3228.04 3231.96 3233.93 3235.80 3239.74 3247.88 3857.08
frequency: 18.20 24.01 32.74 36.72 38.54 62.35 67.76 92.14 101.77 113.77 135.86 154.33 166.04 171.31 189.79 201.34 220.04 223.43 241.05 270.97 289.28 303.12 322.01 335.20 350.49 371.94 379.74 392.97 423.73 427.26 446.99 465.88 473.31 482.28 486.98 509.08 530.39 563.47 596.38 616.70 620.10 648.17 656.06 682.24 709.79 719.81 753.77 769.22 775.18 801.67 823.24 846.19 860.82 861.67 866.43 872.47 893.00 896.85 912.20 951.68 985.92 1004.98 1014.51 1023.61 1030.77 1033.90 1048.88 1074.50 1075.05 1095.69 1099.23 1140.87 1144.29 1145.13 1181.43 1182.78 1183.15 1186.06 1190.66 1213.92 1215.28 1217.74 1219.21 1231.06 1258.61 1272.80 1304.95 1311.29 1312.31 1318.41 1333.19 1336.57 1342.28 1352.63 1375.74 1382.83 1403.09 1403.81 1414.64 1439.35 1451.89 1472.37 1481.88 1487.12 1496.15 1499.48 1502.57 1503.37 1504.22 1505.60 1509.80 1510.41 1513.26 1547.13 1572.31 1602.15 1638.35 1640.98 1651.73 1672.55 1680.69 3017.65 3021.10 3032.51 3050.59 3081.70 3083.42 3100.60 3126.07 3148.89 3151.86 3153.32 3183.65 3190.00 3191.36 3197.25 3215.28 3228.04 3231.96 3233.93 3235.80 3239.74 3247.88 3857.08
formula: C21H23ClNO4
InChI: InChI=1S/C21H23ClNO4/c1-25-19-8-5-16(13-20(19)26-2)18(15-3-6-17(22)7-4-15)14-21(24)23-9-11-27-12-10-23/h3-8,13-14,24H,9-12H2,1-2H3
50 atoms
Cl -1.887436 5.815566 -0.104185
O  -4.362414 -4.110313 0.539813
O  -2.514839 0.098857 -1.173447
O  4.097111 -2.575487 -0.770526
O  5.600296 -0.813722 0.32567
N  -3.021769 -1.663471 0.184373
C  -2.762193 -2.51357 1.353224
C  -4.363544 -1.866763 -0.373638
C  -3.044788 -3.966101 1.010374
C  -4.580465 -3.358109 -0.622793
C  -2.138924 -0.806141 -0.292973
C  0.120038 0.19022 -0.003845
C  -0.749389 -0.866465 0.026728
C  1.555348 -0.036784 0.057026
C  -0.365207 1.585616 -0.023519
C  2.118145 -1.241971 -0.415171
C  2.395727 0.918423 0.617695
C  3.468173 -1.478545 -0.324131
C  0.107346 2.487213 -0.974566
C  -1.296044 2.020612 0.917436
C  4.310477 -0.499165 0.272366
C  3.757374 0.685086 0.734349
C  -0.369118 3.784635 -1.012171
C  -1.76054 3.322759 0.904444
C  -1.301854 4.196527 -0.071068
C  3.327782 -3.58562 -1.385417
C  6.510489 0.117288 0.888275
H  -3.441692 -2.188606 2.14472
H  -1.744615 -2.368455 1.700699
H  -4.474926 -1.341333 -1.320554
H  -5.10262 -1.489155 0.335945
H  -2.328353 -4.326313 0.25997
H  -2.951697 -4.582301 1.902496
H  -5.610397 -3.527687 -0.931462
H  -3.914508 -3.693254 -1.428934
H  -0.365774 -1.846483 0.266755
H  1.484157 -1.967235 -0.90416
H  1.987464 1.843476 1.000272
H  0.838571 2.164563 -1.704405
H  -1.636177 1.340856 1.689801
H  4.385443 1.435342 1.191052
H  -0.017855 4.479393 -1.762346
H  -2.465526 3.6674 1.648328
H  2.826684 -3.211825 -2.282566
H  2.586598 -3.995078 -0.692844
H  4.02682 -4.367968 -1.665004
H  6.272972 0.31246 1.936051
H  6.510363 1.053098 0.325704
H  7.48901 -0.347117 0.819148
H  -3.463113 0.256683 -1.17484
totalener: -1629.77842666 hartree
nucrepener: 2564.85155346 hartree
electener: -4194.62998012 hartree
oneelecener: -7302.26889347 hartree
twoeener: 3107.63891334 hartree
kineticenergy: 1624.07337991 hartree
xcener: -133.973893545781 hartree
chargesum: 1.0000000
charge: -0.025864 -0.287222 -0.213221 -0.255023 -0.239691 -0.036189 -0.124270 -0.142958 0.022761 0.009427 0.335208 0.331344 -0.285367 -0.085152 -0.028988 -0.187782 -0.176741 0.219320 -0.166509 -0.155665 0.268393 -0.177124 -0.139524 -0.158207 0.102214 -0.146358 -0.147881 0.130025 0.126086 0.107364 0.140593 0.083643 0.113883 0.115898 0.089159 0.126905 0.119712 0.153032 0.148421 0.138294 0.125211 0.138908 0.136632 0.103896 0.093972 0.134193 0.110873 0.111556 0.132407 0.210402
charge: 0.444493 0.247418 0.459452 0.312740 0.328696 0.308757 -0.017289 -0.026536 -0.111691 -0.112823 -0.230470 0.025734 -0.036376 -0.090563 -0.076880 -0.002503 0.025740 -0.200605 0.026582 0.006203 -0.183867 -0.015585 -0.016772 -0.026371 -0.386104 -0.047507 -0.031091 0.035923 0.030180 0.025599 0.032783 0.015635 0.033042 0.033494 0.017891 0.024643 0.019000 0.033895 0.036704 0.028622 0.025089 0.031942 0.029599 0.005900 0.002795 0.019188 0.008849 0.009092 0.018983 -0.091633
qa: -0.0259 -0.2872 -0.2132 -0.2550 -0.2397 -0.0362 -0.1243 -0.1430 0.0228 0.0094 0.3352 0.3313 -0.2854 -0.0852 -0.0290 -0.1878 -0.1767 0.2193 -0.1665 -0.1557 0.2684 -0.1771 -0.1395 -0.1582 0.1022 -0.1464 -0.1479 0.1300 0.1261 0.1074 0.1406 0.0836 0.1139 0.1159 0.0892 0.1269 0.1197 0.1530 0.1484 0.1383 0.1252 0.1389 0.1366 0.1039 0.0940 0.1342 0.1109 0.1116 0.1324 0.2104
va: 1.2825 2.0231 2.3045 2.1467 2.1721 3.3009 3.8672 3.8814 3.9501 3.9692 4.0339 3.4589 3.6769 3.7802 3.4802 3.9253 4.0986 3.9986 4.0199 3.9515 3.9615 3.9453 4.0087 4.0314 3.9896 3.8983 3.8839 1.0044 1.0058 1.0201 0.9962 1.0063 1.0013 1.0000 1.0047 1.0139 1.0110 0.9941 0.9989 1.0061 1.0163 1.0100 1.0118 0.9849 0.9864 0.9985 0.9850 0.9856 0.9967 1.0392
dispcorr: -0.024304860 hartree
energy: -1629.802794401177
dipole: 3.59792 -5.42398 -1.82606 -30.82075 29.03443 -1.78632 1.47833 -1.45365 0.02468
magnitude: 2.55461 au
magnitude: 6.49331 debye
temp: 298.15 k
press: 1.00 atm
zeropoint: 0.41329320 hartree
thermalvibcorrection: 0.02204156 hartree
thermalrotcorrection: 0.00141627 hartree
thermaltrasncorrection: 0.00141627 hartree
thermaltotal: -1629.36462710 hartree
thermalcorr: 0.02487410 hartree
nonthermalcorr: 0.41329320 hartree
totalcorr: 0.43816730 hartree
thermalcorrenthalpy: 0.00094421 hartree
totalenthalpy: -1629.36368289 hartree
totalentropycorr: -0.07768226 hartree
gibbsenthalpy: -1629.44136515 hartree
gibbsminuselec: 0.36142926 hartree
