program: Gaussian 09
title: 000044773
version: EM64L-G09RevD.01
frameworkgroup: C1[X(C12H12N4)]
method: RPBEPBE
basis: SDD
operation: Freq
keyword: #pfreq=noraman
keyword: PBEPBE/SDD
title: #p freq=noraman PBEPBE/SDD
converged: NO YES NO NO
title: Mulliken charges:
elementType: N N N N C C C C C C C C C C C C H H H H H H H H H H H H
charge: -0.663213 -0.663212 -0.381754 -0.381752 0.369395 0.426152 -0.558948 -0.558948 0.365612 0.365617 -0.456335 -0.456335 -0.349922 -0.349923 0.073903 0.073901 0.307843 0.307841 0.236954 0.236953 0.188703 0.188703 0.314247 0.312072 0.314247 0.312072 0.213063 0.213063
chargesum: 0.00000
title: Mulliken charges with hydrogens summed into heavy atoms:
elementType: N N N N C C C C C C C C C C C C
charge: -0.036893 -0.036893 -0.168691 -0.168689 0.369395 0.426152 -0.251106 -0.251107 0.365612 0.365617 -0.219381 -0.219381 -0.161218 -0.161220 0.073903 0.073901
polarizability: 2.82577509e+02 -2.59979576e-04 1.79525210e+02 8.28681350e-03 -2.34034734e-02 6.35412636e+01
1716.lowfreq: -53.2486 -53.2304 -0.0003 0.0007 0.0008 0.8093 3.1752 5.8911 77.8834
frequency: -53.2430 -53.2248 77.8831 93.6028 124.2657 220.1928 237.1996 239.6155 292.4391 356.9356 357.3777 367.8948 370.3827 401.5938 439.7302 444.1716 473.9615 474.7309 517.6937 519.5137 529.8330 536.6583 598.9618 630.0982 652.0683 690.5064 696.2836 714.3609 768.3213 788.8522 795.6651 810.9749 812.7503 839.5974 926.2299 941.1526 942.9470 951.4523 964.4282 1000.3355 1037.1842 1040.6519 1070.7756 1073.6632 1107.9264 1110.7236 1162.3918 1190.5647 1233.5923 1258.2450 1272.0255 1333.3930 1350.8691 1378.0472 1414.5700 1429.4565 1442.3356 1462.3973 1521.2227 1562.6798 1590.7618 1597.0341 1610.7322 1634.8061 1640.8447 1646.5404 3114.0468 3114.6384 3138.5519 3140.8881 3153.9341 3155.8351 3326.3168 3326.4429 3545.8665 3545.8994 3688.7159 3688.7384
redmass: 3.5084 3.8432 4.7488 4.2264 5.4949 4.9298 3.4674 4.0534 5.0641 4.7927 1.2328 1.2631 5.0050 2.8117 1.2158 1.1815 4.3852 2.4876 3.1097 3.8261 3.4023 3.2868 3.2004 6.9484 4.3883 2.1268 3.7885 4.5368 4.9427 2.1656 1.6844 1.3678 1.5160 1.8565 4.3214 1.3539 4.5883 1.3859 1.5010 1.5502 1.5980 1.5644 1.6891 1.7136 1.9008 1.7094 1.6260 1.1429 2.2579 1.6075 1.6139 1.8423 3.8202 3.5998 4.9432 4.6326 5.7361 2.7367 3.3609 6.8867 3.8937 3.6852 5.5343 1.6108 1.3731 3.4175 1.0858 1.0854 1.0972 1.0964 1.0924 1.0919 1.0764 1.0763 1.0453 1.0453 1.1030 1.1031
irintensity: 30.0389 0.3736 1.7348 0.0001 4.3947 12.9991 0.0004 9.0233 1.0562 11.1940 93.7077 0.0171 0.0443 0.0002 451.1636 0.0047 10.8780 37.4942 0.4586 8.4442 44.4587 33.2245 0.0003 5.0378 6.7352 0.0002 7.3561 0.3988 0.3698 26.5484 0.0003 0.0006 138.3780 109.1367 1.2981 0.0001 5.5901 0.0005 1.0008 37.9821 0.4903 24.4741 94.1515 132.3077 50.7878 21.6128 1.3880 0.0019 21.6996 11.0399 6.3433 1.3875 179.9100 78.1181 0.2495 0.1131 114.9003 26.4096 13.9246 20.4617 74.4840 102.7293 2.0505 208.5411 122.1348 100.7683 26.3238 1.0198 39.4785 38.7960 0.3927 3.9939 54.9397 0.1328 27.4358 7.4169 31.9642 15.0720
temp: 298.150 k
press: 1.00000 atm
elementType: 7 7 7 7 6 6 6 6 6 6 6 6 6 6 6 6 1 1 1 1 1 1 1 1 1 1 1 1
symmnumber: 1
zpe: 578478.0 jmol-1
zpe.correction: 0.220331 hartree
zpe.thermalcorrener: 0.232721 hartree
zpe.thermalcorrenthalpy: 0.233665 hartree
zpe.thermalcorrgfe: 0.182327 hartree
zpe.sumelectzpe: -682.365580 hartree
zpe.sumelectthermal: -682.353190 hartree
zpe.sumelectthermalent: -682.352245 hartree
zpe.sumelectthermalfe: -682.403583 hartree
dipole: 0.0001 -4.6750 0.0077
dipole: 4.6750
quadrupole: -38.6412 -92.3045 -101.8746
quadrupole: 0.0002 -0.0754 0.0063
quadrupole: 38.9656 -14.6977 -24.2678 0.0002 -0.0754 0.0063
hfenergy: -682.5859106 hartree
pointgroup: C01 [X(C12H12N4)]
dipole: 0.0000139 1.839294 -0.0030285 debye
polarizability: 282.5775088|0.0008934|179.52521|-0.0082867|-0.0234035|63.5412636 unknown
InChI: InChI=1S/C12H12N4/c13-11(14)8-3-1-7-2-4-9(12(15)16)6-10(7)5-8/h1-6,13,15H,14,16H2
charge 0 multiplicity 1
28 atoms
N  4.941261 -0.154853 0.000429
N  -4.941248 -0.154903 -0.003649
N  3.648222 -2.190773 -0.003715
N  -3.648218 -2.190818 0.004872
C  -0.000002 -0.055745 -0.000259
C  -0.000014 1.394231 -0.000154
C  1.248384 -0.753008 -0.000578
C  -1.248376 -0.753031 -0.000048
C  2.471331 -0.068162 -0.00069
C  -2.471333 -0.068203 0.000122
C  1.256777 2.079568 -0.00039
C  -1.256817 2.079547 0.000247
C  2.45827 1.370879 -0.000688
C  -2.458299 1.370838 0.00043
C  3.741334 -0.873822 -0.000913
C  -3.741327 -0.873871 0.000089
H  1.278084 -1.847569 -0.000683
H  -1.278059 -1.847592 -0.000067
H  1.265492 3.176067 -0.000429
H  -1.265551 3.176046 0.00056
H  3.391549 1.946314 -0.001217
H  -3.391591 1.946254 0.00144
H  5.827483 -0.654909 -0.000382
H  4.972846 0.860475 0.003008
H  -5.827473 -0.654953 -0.002911
H  -4.972825 0.860418 -0.008589
H  4.570607 -2.673342 -0.004185
H  -4.570605 -2.673385 0.004851
