program: Orca
programVersion: 5.0.2
elementType: Cl O O O O N C C C C C C C C C C C C C C C C C C C C C H H H H H H H H H H H H H H H H H H H H H H H
charge: 1
multiplicity: 1
keywords: wB97X-D3 TightOpt Freq def2-TZVPP def2/J RIJCOSX TightSCF defgrid3
frequency: 0.00 0.00 0.00 0.00 0.00 0.00 16.56 25.19 29.51 31.15 37.42 53.01 64.81 68.53 95.02 113.72 122.66 139.89 156.75 179.99 189.50 202.54 208.58 217.90 232.61 273.40 286.29 309.57 321.21 333.22 346.07 365.92 381.49 386.71 423.64 440.37 449.52 468.28 479.93 492.90 514.25 540.48 556.16 571.42 581.38 598.94 617.54 645.59 660.26 679.51 708.90 734.34 753.11 770.18 772.76 796.70 818.46 851.91 859.95 868.71 875.44 879.36 890.08 903.37 914.07 944.57 994.05 1008.31 1014.23 1022.57 1028.43 1036.65 1047.56 1059.92 1072.73 1087.14 1095.77 1141.88 1144.27 1148.00 1167.62 1178.14 1181.74 1186.97 1191.72 1208.39 1215.07 1218.72 1223.99 1247.73 1255.21 1266.43 1299.68 1303.69 1305.65 1328.04 1337.13 1340.34 1345.03 1357.16 1366.02 1373.32 1401.61 1410.10 1414.80 1437.73 1450.40 1460.96 1480.45 1488.50 1493.56 1496.33 1497.97 1502.83 1503.32 1507.94 1510.52 1511.28 1513.68 1545.31 1584.95 1603.77 1633.42 1647.19 1667.78 1676.24 1701.51 3014.55 3021.21 3039.36 3076.21 3092.08 3095.45 3110.11 3148.25 3151.25 3167.19 3183.59 3186.45 3201.29 3206.07 3207.13 3210.98 3213.64 3233.48 3235.26 3236.17 3242.37 3270.63 3710.94
frequency: 16.56 25.19 29.51 31.15 37.42 53.01 64.81 68.53 95.02 113.72 122.66 139.89 156.75 179.99 189.50 202.54 208.58 217.90 232.61 273.40 286.29 309.57 321.21 333.22 346.07 365.92 381.49 386.71 423.64 440.37 449.52 468.28 479.93 492.90 514.25 540.48 556.16 571.42 581.38 598.94 617.54 645.59 660.26 679.51 708.90 734.34 753.11 770.18 772.76 796.70 818.46 851.91 859.95 868.71 875.44 879.36 890.08 903.37 914.07 944.57 994.05 1008.31 1014.23 1022.57 1028.43 1036.65 1047.56 1059.92 1072.73 1087.14 1095.77 1141.88 1144.27 1148.00 1167.62 1178.14 1181.74 1186.97 1191.72 1208.39 1215.07 1218.72 1223.99 1247.73 1255.21 1266.43 1299.68 1303.69 1305.65 1328.04 1337.13 1340.34 1345.03 1357.16 1366.02 1373.32 1401.61 1410.10 1414.80 1437.73 1450.40 1460.96 1480.45 1488.50 1493.56 1496.33 1497.97 1502.83 1503.32 1507.94 1510.52 1511.28 1513.68 1545.31 1584.95 1603.77 1633.42 1647.19 1667.78 1676.24 1701.51 3014.55 3021.21 3039.36 3076.21 3092.08 3095.45 3110.11 3148.25 3151.25 3167.19 3183.59 3186.45 3201.29 3206.07 3207.13 3210.98 3213.64 3233.48 3235.26 3236.17 3242.37 3270.63 3710.94
formula: C21H23ClNO4
InChI: InChI=1S/C21H23ClNO4/c1-25-19-8-5-16(13-20(19)26-2)18(15-3-6-17(22)7-4-15)14-21(24)23-9-11-27-12-10-23/h3-8,13-14,24H,9-12H2,1-2H3
50 atoms
Cl -0.787971 5.68111 -0.19218
O  6.040757 -2.287238 0.06187
O  2.725795 1.047992 -0.567739
O  -4.668242 -0.918357 0.768504
O  -4.440554 -3.491693 -0.297739
N  3.741274 -0.691378 0.344882
C  5.048362 -0.080164 0.057089
C  3.874308 -1.961002 1.06584
C  5.9178 -1.095181 -0.673028
C  4.793398 -2.890709 0.285694
C  2.606629 -0.137437 -0.013415
C  0.104061 -0.232869 -0.019964
C  1.333305 -0.797353 0.124348
C  -1.091052 -1.067468 -0.103077
C  -0.09785 1.239767 -0.06752
C  -2.327751 -0.560524 0.323038
C  -1.036686 -2.37406 -0.588456
C  -3.474787 -1.330848 0.297121
C  0.26346 2.043186 1.014895
C  -0.693297 1.832554 -1.182781
C  -3.410352 -2.644528 -0.22324
C  -2.181503 -3.137797 -0.651018
C  0.045962 3.409199 0.983639
C  -0.893062 3.20056 -1.230424
C  -0.525596 3.982962 -0.143585
C  -4.780039 0.394809 1.279445
C  -5.768643 -3.045412 -0.579495
H  5.505308 0.189735 1.010919
H  4.916225 0.81681 -0.536887
H  2.907167 -2.418092 1.23961
H  4.319274 -1.734645 2.036908
H  5.495547 -1.299333 -1.665833
H  6.920103 -0.690922 -0.801075
H  4.971371 -3.797749 0.860499
H  4.322578 -3.168116 -0.667301
H  1.373536 -1.860002 0.293281
H  -2.374858 0.440814 0.724657
H  -0.111648 -2.780876 -0.974987
H  0.702375 1.5909 1.895775
H  -0.997976 1.216219 -2.019442
H  -2.162535 -4.140896 -1.054796
H  0.314207 4.0295 1.827509
H  -1.339812 3.661742 -2.100264
H  -4.539298 1.139025 0.515818
H  -4.134417 0.536923 2.149734
H  -5.816731 0.511999 1.580388
H  -5.760039 -2.239799 -1.313368
H  -6.272585 -2.71585 0.32496
H  -6.277064 -3.910711 -0.99587
H  1.856931 1.417501 -0.78018
totalener: -1629.78449740 hartree
nucrepener: 2571.75153213 hartree
electener: -4201.53602953 hartree
oneelecener: -7315.45837312 hartree
twoeener: 3113.92234359 hartree
kineticenergy: 1624.07245780 hartree
xcener: -133.979047947585 hartree
chargesum: 1.0000000
charge: -0.010556 -0.289003 -0.262353 -0.297562 -0.277951 -0.028330 -0.099184 -0.112896 0.013325 0.023352 0.390883 0.265193 -0.201418 -0.074305 -0.156405 -0.184192 -0.155925 0.268250 -0.164614 -0.172369 0.178527 -0.156646 -0.117969 -0.121197 0.091209 -0.137567 -0.113203 0.120937 0.126116 0.113780 0.126945 0.087583 0.112128 0.111487 0.083567 0.106581 0.136449 0.132639 0.144354 0.149544 0.133816 0.143666 0.145797 0.104178 0.105971 0.126674 0.107798 0.112892 0.125421 0.244580
charge: 0.458294 0.244701 0.442359 0.299311 0.306583 0.323777 -0.010784 -0.015274 -0.112309 -0.114966 -0.222606 0.008655 -0.024724 -0.089871 -0.100052 0.012749 0.005967 -0.203709 0.010141 0.014917 -0.190470 0.010274 -0.016612 -0.015571 -0.385727 -0.044223 -0.028279 0.033448 0.028263 0.024896 0.036734 0.016681 0.032670 0.032288 0.015539 0.022157 0.025834 0.024787 0.034786 0.039085 0.035184 0.033692 0.034221 0.006584 0.007838 0.018381 0.007156 0.003935 0.013173 -0.089887
qa: -0.0106 -0.2890 -0.2624 -0.2976 -0.2780 -0.0283 -0.0992 -0.1129 0.0133 0.0234 0.3909 0.2652 -0.2014 -0.0743 -0.1564 -0.1842 -0.1559 0.2683 -0.1646 -0.1724 0.1785 -0.1566 -0.1180 -0.1212 0.0912 -0.1376 -0.1132 0.1209 0.1261 0.1138 0.1269 0.0876 0.1121 0.1115 0.0836 0.1066 0.1364 0.1326 0.1444 0.1495 0.1338 0.1437 0.1458 0.1042 0.1060 0.1267 0.1078 0.1129 0.1254 0.2446
va: 1.2981 2.0221 2.2778 2.1061 2.1203 3.3480 3.8424 3.8719 3.9550 3.9496 4.0005 3.4923 3.7045 3.7693 3.7203 3.9004 4.0480 3.7817 3.9879 3.9832 4.0304 4.0445 4.0003 3.9717 4.0175 3.8943 3.8503 1.0056 1.0266 1.0124 1.0050 1.0040 1.0008 1.0012 1.0043 1.0275 1.0004 0.9996 1.0071 1.0069 1.0162 1.0094 1.0088 0.9866 0.9863 0.9984 0.9939 0.9929 0.9946 1.0412
dispcorr: -0.025041628 hartree
energy: -1629.809604557391
dipole: 4.90039 -3.43085 1.46954 -23.17547 22.82906 -0.34641 1.79296 -1.68873 0.10423
magnitude: 1.51342 au
magnitude: 3.84680 debye
temp: 298.15 k
press: 1.00 atm
zeropoint: 0.41336530 hartree
thermalvibcorrection: 0.02217014 hartree
thermalrotcorrection: 0.00141627 hartree
thermaltrasncorrection: 0.00141627 hartree
thermaltotal: -1629.37123658 hartree
thermalcorr: 0.02500269 hartree
nonthermalcorr: 0.41336530 hartree
totalcorr: 0.43836798 hartree
thermalcorrenthalpy: 0.00094421 hartree
totalenthalpy: -1629.37029237 hartree
totalentropycorr: -0.07813685 hartree
gibbsenthalpy: -1629.44842921 hartree
gibbsminuselec: 0.36117534 hartree
