program: Orca
programVersion: 5.0.2
elementType: Cl O O O O N C C C C C C C C C C C C C C C C C C C C C H H H H H H H H H H H H H H H H H H H H H H H
charge: 1
multiplicity: 1
keywords: wB97X-D3 TightOpt Freq def2-TZVPP def2/J RIJCOSX TightSCF defgrid3
frequency: 0.00 0.00 0.00 0.00 0.00 0.00 18.98 25.50 29.93 33.97 38.09 58.18 63.48 68.94 96.14 112.97 119.28 137.52 156.01 178.99 191.01 206.01 215.01 217.82 233.89 273.72 290.34 301.75 320.36 331.12 347.11 353.48 377.95 383.39 422.84 426.93 444.00 468.65 478.59 481.83 494.18 513.59 536.66 560.40 580.35 597.78 616.27 647.70 661.79 678.51 707.30 720.78 754.28 769.23 771.97 795.16 824.10 853.65 861.21 868.38 871.96 876.47 890.93 907.15 917.63 953.00 995.37 1003.25 1016.90 1022.19 1026.79 1033.08 1047.97 1060.52 1075.31 1087.14 1095.32 1140.59 1143.82 1144.75 1166.61 1178.10 1181.86 1187.94 1193.15 1208.14 1214.19 1217.71 1220.21 1230.80 1258.48 1264.05 1299.95 1304.51 1312.26 1318.35 1335.97 1337.89 1344.91 1348.57 1359.57 1376.12 1403.49 1407.65 1415.60 1439.96 1451.67 1461.35 1481.58 1488.18 1494.88 1496.72 1499.17 1502.80 1503.27 1506.78 1510.19 1510.50 1515.14 1547.28 1581.10 1590.87 1634.98 1643.18 1649.58 1674.45 1680.59 3020.64 3022.94 3039.99 3076.74 3079.70 3082.99 3110.76 3148.31 3151.13 3152.73 3167.60 3183.22 3186.64 3191.76 3197.36 3213.76 3213.88 3232.02 3233.36 3235.12 3242.20 3246.33 3856.69
frequency: 18.98 25.50 29.93 33.97 38.09 58.18 63.48 68.94 96.14 112.97 119.28 137.52 156.01 178.99 191.01 206.01 215.01 217.82 233.89 273.72 290.34 301.75 320.36 331.12 347.11 353.48 377.95 383.39 422.84 426.93 444.00 468.65 478.59 481.83 494.18 513.59 536.66 560.40 580.35 597.78 616.27 647.70 661.79 678.51 707.30 720.78 754.28 769.23 771.97 795.16 824.10 853.65 861.21 868.38 871.96 876.47 890.93 907.15 917.63 953.00 995.37 1003.25 1016.90 1022.19 1026.79 1033.08 1047.97 1060.52 1075.31 1087.14 1095.32 1140.59 1143.82 1144.75 1166.61 1178.10 1181.86 1187.94 1193.15 1208.14 1214.19 1217.71 1220.21 1230.80 1258.48 1264.05 1299.95 1304.51 1312.26 1318.35 1335.97 1337.89 1344.91 1348.57 1359.57 1376.12 1403.49 1407.65 1415.60 1439.96 1451.67 1461.35 1481.58 1488.18 1494.88 1496.72 1499.17 1502.80 1503.27 1506.78 1510.19 1510.50 1515.14 1547.28 1581.10 1590.87 1634.98 1643.18 1649.58 1674.45 1680.59 3020.64 3022.94 3039.99 3076.74 3079.70 3082.99 3110.76 3148.31 3151.13 3152.73 3167.60 3183.22 3186.64 3191.76 3197.36 3213.76 3213.88 3232.02 3233.36 3235.12 3242.20 3246.33 3856.69
formula: C21H23ClNO4
InChI: InChI=1S/C21H23ClNO4/c1-25-19-8-5-16(13-20(19)26-2)18(15-3-6-17(22)7-4-15)14-21(24)23-9-11-27-12-10-23/h3-8,13-14,24H,9-12H2,1-2H3
50 atoms
Cl -0.348874 5.70806 -0.023856
O  5.865279 -2.471821 0.535797
O  2.571208 0.747196 -1.175893
O  -4.676754 -0.767013 0.901237
O  -4.641151 -3.284062 -0.316947
N  3.66362 -0.764337 0.138491
C  5.00102 -0.3816 -0.329764
C  3.705484 -1.710376 1.262324
C  5.822366 -1.642435 -0.592851
C  4.578772 -2.901626 0.907975
C  2.539506 -0.282761 -0.356371
C  0.059587 -0.250566 -0.18457
C  1.266685 -0.888481 -0.120892
C  -1.175749 -1.022085 -0.222185
C  -0.044119 1.223409 -0.144546
C  -2.356458 -0.487666 0.316354
C  -1.214634 -2.30249 -0.776131
C  -3.537571 -1.204104 0.327023
C  0.581902 1.947664 0.867138
C  -0.787268 1.906338 -1.105227
C  -3.569602 -2.487924 -0.266376
C  -2.395582 -3.010768 -0.801378
C  0.484451 3.326563 0.9155
C  -0.87064 3.286052 -1.080795
C  -0.234052 3.990383 -0.068225
C  -4.690594 0.52133 1.483033
C  -5.964463 -2.766065 -0.466485
H  5.481978 0.231608 0.435316
H  4.940034 0.184366 -1.257944
H  2.699472 -2.013092 1.53279
H  4.14173 -1.180282 2.112367
H  5.398995 -2.180728 -1.451019
H  6.846912 -1.362395 -0.830972
H  4.692493 -3.546847 1.776846
H  4.119795 -3.483529 0.097858
H  1.281064 -1.95097 0.067373
H  -2.326334 0.489183 0.775176
H  -0.335005 -2.72534 -1.243223
H  1.125576 1.423994 1.644644
H  -1.287711 1.353717 -1.890046
H  -2.450673 -3.9900 -1.257083
H  0.952547 3.887559 1.712566
H  -1.429339 3.818243 -1.838143
H  -4.462155 1.292748 0.743083
H  -3.983985 0.587531 2.314115
H  -5.69877 0.670258 1.857854
H  -5.975064 -1.920614 -1.153976
H  -6.380772 -2.467762 0.49175
H  -6.543571 -3.583713 -0.886855
H  3.391302 1.246572 -1.128531
totalener: -1629.77375971 hartree
nucrepener: 2573.17215111 hartree
electener: -4202.94591081 hartree
oneelecener: -7318.91619651 hartree
twoeener: 3115.97028569 hartree
kineticenergy: 1624.07040384 hartree
xcener: -133.972943710191 hartree
chargesum: 1.0000000
charge: -0.025190 -0.287027 -0.212945 -0.299212 -0.277432 -0.034826 -0.145609 -0.123416 0.009087 0.022804 0.344524 0.322156 -0.273897 -0.058995 -0.037125 -0.202786 -0.150243 0.273593 -0.156512 -0.164437 0.180397 -0.159085 -0.158790 -0.144251 0.102737 -0.136946 -0.113544 0.142128 0.107578 0.126532 0.129530 0.090250 0.115889 0.113846 0.086844 0.127227 0.141512 0.136050 0.138936 0.147609 0.133114 0.137555 0.139830 0.105127 0.105917 0.125277 0.108309 0.112667 0.124957 0.210287
charge: 0.444538 0.247861 0.461177 0.297734 0.306765 0.309974 -0.026080 -0.015937 -0.112823 -0.110758 -0.227935 0.025895 -0.032010 -0.088869 -0.077703 0.014634 0.008253 -0.204441 0.005600 0.025585 -0.189322 0.008931 -0.026269 -0.018062 -0.386829 -0.044313 -0.028648 0.032708 0.025753 0.030203 0.035808 0.018480 0.033699 0.033419 0.016808 0.026373 0.026678 0.026062 0.028745 0.037239 0.034645 0.029755 0.031913 0.007100 0.007918 0.017808 0.007290 0.003750 0.012921 -0.092020
qa: -0.0252 -0.2870 -0.2129 -0.2992 -0.2774 -0.0348 -0.1456 -0.1234 0.0091 0.0228 0.3445 0.3222 -0.2739 -0.0590 -0.0371 -0.2028 -0.1502 0.2736 -0.1565 -0.1644 0.1804 -0.1591 -0.1588 -0.1443 0.1027 -0.1369 -0.1135 0.1421 0.1076 0.1265 0.1295 0.0903 0.1159 0.1138 0.0868 0.1272 0.1415 0.1360 0.1389 0.1476 0.1331 0.1376 0.1398 0.1051 0.1059 0.1253 0.1083 0.1127 0.1250 0.2103
va: 1.2832 2.0237 2.3063 2.1035 2.1212 3.3079 3.8807 3.8673 3.9732 3.9507 4.0198 3.4457 3.6893 3.7435 3.4904 3.9112 4.0368 3.7776 3.9525 4.0014 4.0303 4.0361 4.0295 4.0064 3.9879 3.8953 3.8508 0.9955 1.0193 1.0060 1.0043 1.0046 0.9998 1.0013 1.0062 1.0172 1.0023 0.9986 1.0059 1.0000 1.0164 1.0115 1.0097 0.9868 0.9864 0.9982 0.9940 0.9931 0.9945 1.0404
dispcorr: -0.025018006 hartree
energy: -1629.798860363647
dipole: 4.65262 -2.10806 2.54456 -23.18915 22.57715 -0.61200 2.61876 -2.64762 -0.02886
magnitude: 2.61728 au
magnitude: 6.65261 debye
temp: 298.15 k
press: 1.00 atm
zeropoint: 0.41294817 hartree
thermalvibcorrection: 0.02225217 hartree
thermalrotcorrection: 0.00141627 hartree
thermaltrasncorrection: 0.00141627 hartree
thermaltotal: -1629.36082747 hartree
thermalcorr: 0.02508472 hartree
nonthermalcorr: 0.41294817 hartree
totalcorr: 0.43803289 hartree
thermalcorrenthalpy: 0.00094421 hartree
totalenthalpy: -1629.35988327 hartree
totalentropycorr: -0.07815404 hartree
gibbsenthalpy: -1629.43803731 hartree
gibbsminuselec: 0.36082306 hartree
