program: Orca
programVersion: 5.0.2
elementType: Cl S O O N N C C C C C C C C H H H H H H H H
charge: 1
multiplicity: 1
keywords: wB97X-D3 TightOpt Freq def2-TZVPP def2/J RIJCOSX TightSCF defgrid3
frequency: 0.00 0.00 0.00 0.00 0.00 0.00 35.37 44.72 99.44 120.59 160.16 178.46 189.36 276.97 299.88 315.02 359.72 371.33 391.49 443.71 458.84 509.09 523.00 546.55 580.32 586.73 634.73 661.64 697.24 749.23 801.86 858.94 869.02 913.00 929.68 932.31 1023.60 1033.62 1063.04 1110.43 1122.77 1147.14 1168.07 1189.45 1271.03 1297.94 1331.82 1375.93 1410.56 1420.97 1439.07 1464.50 1493.77 1537.51 1585.59 1641.98 1674.41 1684.83 3084.38 3164.59 3184.64 3213.99 3231.96 3237.02 3652.46 3779.85
frequency: 35.37 44.72 99.44 120.59 160.16 178.46 189.36 276.97 299.88 315.02 359.72 371.33 391.49 443.71 458.84 509.09 523.00 546.55 580.32 586.73 634.73 661.64 697.24 749.23 801.86 858.94 869.02 913.00 929.68 932.31 1023.60 1033.62 1063.04 1110.43 1122.77 1147.14 1168.07 1189.45 1271.03 1297.94 1331.82 1375.93 1410.56 1420.97 1439.07 1464.50 1493.77 1537.51 1585.59 1641.98 1674.41 1684.83 3084.38 3164.59 3184.64 3213.99 3231.96 3237.02 3652.46 3779.85
formula: C8H8ClN2O2S
InChI: InChI=1S/C8H8ClN2O2S/c1-5-10-7-3-2-6(9)4-8(7)14(12,13)11-5/h2-4,10,12H,1H3
22 atoms
Cl -4.1149 -0.270386 -0.047972
S  1.172765 -1.264918 -0.088724
O  1.141085 -1.947862 1.313652
O  1.079004 -2.245534 -1.102495
N  1.450982 1.663207 0.037434
N  2.478931 -0.418515 -0.105019
C  -0.147815 -0.161864 -0.016353
C  0.135147 1.200217 0.03495
C  2.533347 0.8882 -0.042041
C  -1.45851 -0.635661 -0.049751
C  -0.92455 2.103367 0.070591
C  -2.492379 0.272862 -0.013208
C  -2.220609 1.6431 0.049595
C  3.873307 1.534962 -0.067428
H  1.591068 2.660145 0.074197
H  -1.658114 -1.697201 -0.108964
H  -0.729814 3.16769 0.110448
H  -3.04337 2.344573 0.076367
H  3.814582 2.618694 0.00113
H  4.379715 1.255392 -0.99102
H  4.467829 1.148616 0.759702
H  1.360787 -2.889063 1.249456
totalener: -1427.82408188 hartree
nucrepener: 1153.38871933 hartree
electener: -2581.21280121 hartree
oneelecener: -4232.21390039 hartree
twoeener: 1651.00109917 hartree
kineticenergy: 1424.11583697 hartree
xcener: -93.773488646739 hartree
chargesum: 1.0000000
charge: 0.025117 0.739790 -0.225495 -0.339728 -0.110325 -0.292566 -0.066220 0.189315 0.315053 -0.040483 -0.181744 0.008602 -0.023465 -0.157454 0.165484 0.129947 0.136115 0.152501 0.073905 0.126656 0.123499 0.251495
charge: 0.490892 0.792429 0.189302 -0.172550 0.394957 -0.041930 -0.227027 -0.120717 -0.221496 -0.001384 0.026311 -0.388673 0.030413 0.064314 0.022382 0.042600 0.037502 0.045143 0.027624 0.050763 0.049268 -0.090122
qa: 0.0251 0.7398 -0.2255 -0.3397 -0.1103 -0.2926 -0.0662 0.1893 0.3151 -0.0405 -0.1817 0.0086 -0.0235 -0.1575 0.1655 0.1299 0.1361 0.1525 0.0739 0.1267 0.1235 0.2515
va: 1.3287 5.8458 2.2188 2.1616 3.4676 2.9864 3.8484 3.8527 3.9876 3.9679 4.0341 4.1195 3.9888 3.9197 1.0185 1.0219 1.0094 1.0027 1.0148 1.0048 1.0051 1.0131
dispcorr: -0.009390089 hartree
energy: -1427.833482432103
dipole: 15.52023 -13.69040 1.82983 8.65819 -6.85961 1.79858 1.20424 -0.50871 0.69554
magnitude: 2.65837 au
magnitude: 6.75705 debye
temp: 298.15 k
press: 1.00 atm
zeropoint: 0.16078242 hartree
thermalvibcorrection: 0.00981694 hartree
thermalrotcorrection: 0.00141627 hartree
thermaltrasncorrection: 0.00141627 hartree
thermaltotal: -1427.66005053 hartree
thermalcorr: 0.01264949 hartree
nonthermalcorr: 0.16078242 hartree
totalcorr: 0.17343190 hartree
thermalcorrenthalpy: 0.00094421 hartree
totalenthalpy: -1427.65910632 hartree
totalentropycorr: -0.05232876 hartree
gibbsenthalpy: -1427.71143509 hartree
gibbsminuselec: 0.12204735 hartree
