program: Orca
programVersion: 5.0.2
elementType: S O N N C C C C C C C C C C C C C C C C C C C C C C C H H H H H H H H H H H H H H H H H H H H H H H H H H H H H H H H H
charge: 1
multiplicity: 1
keywords: wB97X-D3 TightOpt Freq def2-TZVPP def2/J RIJCOSX TightSCF defgrid3
frequency: 0.00 0.00 0.00 0.00 0.00 0.00 12.07 20.84 25.94 28.96 34.15 42.96 50.53 53.59 58.45 81.13 99.96 113.77 143.42 146.85 156.72 178.59 181.38 212.09 235.11 238.30 249.28 255.38 259.29 267.89 269.61 278.74 283.69 294.92 296.70 317.22 337.97 357.96 364.61 395.70 413.50 422.60 426.01 429.08 445.45 464.38 466.62 501.46 519.10 523.73 544.03 577.82 594.74 615.42 625.05 632.99 656.70 664.70 667.51 693.83 725.38 736.47 766.43 800.69 811.77 834.96 862.61 868.67 894.82 904.31 914.51 919.39 937.30 938.53 941.49 942.70 952.10 961.07 971.29 978.97 980.30 981.99 982.14 1012.23 1018.79 1033.11 1044.15 1059.01 1060.06 1067.30 1106.04 1107.84 1120.83 1141.27 1149.77 1157.24 1184.97 1193.04 1212.63 1213.56 1232.33 1237.76 1264.01 1268.47 1272.91 1276.93 1309.74 1322.69 1336.43 1341.21 1345.79 1353.60 1363.91 1389.80 1398.61 1414.92 1415.91 1423.36 1427.82 1433.41 1436.52 1440.08 1454.00 1480.80 1485.28 1486.58 1488.72 1489.61 1496.39 1497.79 1499.36 1507.58 1508.03 1513.78 1515.86 1516.04 1517.44 1518.25 1523.38 1525.37 1546.60 1592.25 1658.03 1661.40 1670.99 1680.33 1690.48 2706.32 3052.72 3053.72 3063.19 3063.24 3065.13 3065.95 3066.60 3071.87 3075.83 3124.18 3124.79 3139.55 3140.91 3141.48 3143.88 3144.82 3145.09 3145.76 3146.26 3148.25 3159.27 3160.46 3168.23 3205.61 3212.11 3220.20 3225.99 3232.96 3236.44 3245.61 3639.21 3645.67
frequency: 12.07 20.84 25.94 28.96 34.15 42.96 50.53 53.59 58.45 81.13 99.96 113.77 143.42 146.85 156.72 178.59 181.38 212.09 235.11 238.30 249.28 255.38 259.29 267.89 269.61 278.74 283.69 294.92 296.70 317.22 337.97 357.96 364.61 395.70 413.50 422.60 426.01 429.08 445.45 464.38 466.62 501.46 519.10 523.73 544.03 577.82 594.74 615.42 625.05 632.99 656.70 664.70 667.51 693.83 725.38 736.47 766.43 800.69 811.77 834.96 862.61 868.67 894.82 904.31 914.51 919.39 937.30 938.53 941.49 942.70 952.10 961.07 971.29 978.97 980.30 981.99 982.14 1012.23 1018.79 1033.11 1044.15 1059.01 1060.06 1067.30 1106.04 1107.84 1120.83 1141.27 1149.77 1157.24 1184.97 1193.04 1212.63 1213.56 1232.33 1237.76 1264.01 1268.47 1272.91 1276.93 1309.74 1322.69 1336.43 1341.21 1345.79 1353.60 1363.91 1389.80 1398.61 1414.92 1415.91 1423.36 1427.82 1433.41 1436.52 1440.08 1454.00 1480.80 1485.28 1486.58 1488.72 1489.61 1496.39 1497.79 1499.36 1507.58 1508.03 1513.78 1515.86 1516.04 1517.44 1518.25 1523.38 1525.37 1546.60 1592.25 1658.03 1661.40 1670.99 1680.33 1690.48 2706.32 3052.72 3053.72 3063.19 3063.24 3065.13 3065.95 3066.60 3071.87 3075.83 3124.18 3124.79 3139.55 3140.91 3141.48 3143.88 3144.82 3145.09 3145.76 3146.26 3148.25 3159.27 3160.46 3168.23 3205.61 3212.11 3220.20 3225.99 3232.96 3236.44 3245.61 3639.21 3645.67
formula: C23H33N2OS
InChI: InChI=1S/C23H33N2OS/c1-15(2)19-13-18(26-17-11-9-8-10-12-17)14-20(16(3)4)21(19)24-22(27)25-23(5,6)7/h8-16,24-25,27H,1-7H3
60 atoms
S  2.105299 -0.111147 2.511633
O  -3.409329 1.488319 0.025234
N  1.899252 -0.048916 -0.157086
N  3.955137 -0.616269 0.753658
C  0.185561 1.693001 -0.074918
C  -0.457342 -0.679092 -0.090618
C  0.51151 0.32792 -0.096166
C  1.262801 2.758922 -0.157298
C  -0.075741 -2.144803 -0.186745
C  4.766767 -0.847762 -0.475857
C  -1.15276 2.031075 -0.030295
C  -1.790944 -0.299166 -0.047759
C  -2.136578 1.045696 -0.018137
C  1.592664 3.045939 -1.626384
C  0.907071 4.046201 0.580978
C  -1.014007 -3.069766 0.584225
C  0.013497 -2.557474 -1.660023
C  2.686294 -0.267189 0.879259
C  4.189364 -2.01009 -1.286217
C  6.152715 -1.231842 0.040085
C  4.872508 0.4385 -1.297622
C  -4.449294 0.56595 0.016863
C  -4.95944 0.116071 1.220851
C  -4.983392 0.163407 -1.19371
C  -6.02845 -0.767503 1.208159
C  -6.052146 -0.720416 -1.194203
C  -6.573138 -1.187882 0.003609
H  2.165277 2.360844 0.314433
H  0.918499 -2.262942 0.251869
H  -1.469628 3.064029 -0.007204
H  -2.568095 -1.048641 -0.038755
H  2.31302 -0.157696 -1.068412
H  1.874971 2.141353 -2.169483
H  2.414317 3.758261 -1.705637
H  0.726038 3.470088 -2.135526
H  0.087813 4.579506 0.097732
H  1.765624 4.717559 0.588267
H  0.622172 3.85141 1.615257
H  -2.006868 -3.110938 0.135014
H  -0.618309 -4.085298 0.580221
H  -1.124814 -2.754694 1.622252
H  0.70609 -1.926302 -2.221158
H  0.347128 -3.591441 -1.752008
H  -0.962421 -2.47233 -2.140303
H  4.452559 -0.750932 1.618856
H  3.207438 -1.804716 -1.713492
H  4.104762 -2.90572 -0.671261
H  4.85602 -2.231362 -2.118707
H  6.588481 -0.427947 0.635707
H  6.818833 -1.422251 -0.799063
H  6.110811 -2.139386 0.644688
H  3.926296 0.76455 -1.730428
H  5.559603 0.277123 -2.12725
H  5.259856 1.2554 -0.689259
H  -4.527673 0.465542 2.149606
H  -4.569694 0.548684 -2.116542
H  -6.441014 -1.121693 2.143775
H  -6.483487 -1.037715 -2.134585
H  -7.410682 -1.872703 -0.001531
H  0.860234 0.237994 2.15276
totalener: -1479.15135761 hartree
nucrepener: 2748.08460666 hartree
electener: -4227.23596427 hartree
oneelecener: -7454.80264215 hartree
twoeener: 3227.56667788 hartree
kineticenergy: 1473.41047846 hartree
xcener: -128.165726530618 hartree
chargesum: 1.0000000
charge: 0.011679 -0.276569 -0.085696 -0.113008 -0.038604 -0.016002 -0.057125 -0.061363 -0.082768 0.069478 -0.078303 -0.100858 0.181701 -0.271966 -0.245312 -0.240453 -0.268034 0.225198 -0.255351 -0.271116 -0.255123 0.197270 -0.149933 -0.150967 -0.126717 -0.126271 -0.105769 0.045505 0.046916 0.132599 0.134004 0.185920 0.070618 0.109799 0.113494 0.088943 0.104180 0.106752 0.087180 0.104019 0.103939 0.071628 0.109240 0.112718 0.148670 0.075457 0.116244 0.118787 0.117562 0.102785 0.117091 0.076603 0.118587 0.116213 0.129875 0.132752 0.139222 0.139914 0.140831 0.173933
charge: 0.656762 0.347252 0.374917 0.355565 -0.056677 -0.054115 -0.145877 -0.095579 -0.095196 -0.211693 0.019548 0.009977 -0.182837 0.024045 0.024475 0.024776 0.024198 -0.450854 0.030790 0.032026 0.031068 -0.193010 -0.006484 -0.005701 -0.001709 -0.001630 -0.006499 0.022838 0.022543 0.034405 0.030286 -0.016128 0.004155 0.020589 0.024952 0.017161 0.020771 0.018086 0.017270 0.020575 0.017768 0.005213 0.020516 0.024527 -0.003482 0.007582 0.026815 0.034154 0.023548 0.033763 0.023443 0.007418 0.034187 0.026979 0.027624 0.028422 0.026511 0.026655 0.025658 -0.102342
qa: 0.0117 -0.2766 -0.0857 -0.1130 -0.0386 -0.0160 -0.0571 -0.0614 -0.0828 0.0695 -0.0783 -0.1009 0.1817 -0.2720 -0.2453 -0.2405 -0.2680 0.2252 -0.2554 -0.2711 -0.2551 0.1973 -0.1499 -0.1510 -0.1267 -0.1263 -0.1058 0.0455 0.0469 0.1326 0.1340 0.1859 0.0706 0.1098 0.1135 0.0889 0.1042 0.1068 0.0872 0.1040 0.1039 0.0716 0.1092 0.1127 0.1487 0.0755 0.1162 0.1188 0.1176 0.1028 0.1171 0.0766 0.1186 0.1162 0.1299 0.1328 0.1392 0.1399 0.1408 0.1739
va: 2.3618 2.1556 3.2266 3.2982 3.8547 3.8035 3.7179 3.9232 3.9500 3.9820 3.9768 3.8512 4.0790 3.9156 3.9052 3.9034 3.9184 4.1795 3.8989 3.8818 3.8977 3.7985 3.9989 3.9983 3.9578 3.9558 3.9377 1.0025 1.0013 1.0184 1.0091 1.0129 1.0044 1.0048 1.0077 1.0063 1.0051 1.0049 1.0084 1.0054 1.0063 1.0044 1.0052 1.0068 1.0303 1.0171 1.0089 1.0128 1.0024 1.0118 1.0025 1.0175 1.0126 1.0090 1.0075 1.0065 0.9981 0.9980 0.9975 1.0106
dispcorr: -0.035376683 hartree
energy: -1479.186825329261
dipole: 27.95975 -24.12397 3.83577 -6.11800 5.16949 -0.94851 -13.47453 13.53821 0.06368
magnitude: 3.95182 au
magnitude: 10.04473 debye
temp: 298.15 k
press: 1.00 atm
zeropoint: 0.52199667 hartree
thermalvibcorrection: 0.02663788 hartree
thermalrotcorrection: 0.00141627 hartree
thermaltrasncorrection: 0.00141627 hartree
thermaltotal: -1478.63535824 hartree
thermalcorr: 0.02947042 hartree
nonthermalcorr: 0.52199667 hartree
totalcorr: 0.55146709 hartree
thermalcorrenthalpy: 0.00094421 hartree
totalenthalpy: -1478.63441403 hartree
totalentropycorr: -0.08588939 hartree
gibbsenthalpy: -1478.72030342 hartree
gibbsminuselec: 0.46652191 hartree
