program: Orca
programVersion: 5.0.2
elementType: Cl Cl O O O N N N C C C C C C C C C C C C C C C C C C C H H H H H H H H H H H H H H H H H H
charge: 1
multiplicity: 1
keywords: wB97X-D3 TightOpt Freq def2-TZVPP def2/J RIJCOSX TightSCF defgrid3
frequency: 0.00 0.00 0.00 0.00 0.00 0.00 12.44 17.97 23.01 31.85 41.17 62.33 65.84 86.38 98.57 118.51 141.64 153.13 177.21 186.58 190.65 228.78 241.70 263.32 282.37 300.91 306.16 332.41 346.85 375.60 384.36 401.59 424.22 430.27 456.36 467.78 481.80 500.73 536.44 557.63 594.27 622.82 633.50 644.78 659.84 687.21 689.35 704.62 709.28 738.50 751.22 780.97 818.08 840.00 843.32 859.43 871.74 880.26 889.37 894.64 899.44 916.93 937.82 963.58 969.56 980.81 993.34 1001.48 1015.94 1026.58 1034.32 1052.09 1093.00 1098.04 1103.19 1116.57 1129.72 1136.67 1152.18 1159.40 1168.61 1175.88 1176.65 1180.42 1203.34 1209.82 1234.14 1253.00 1256.73 1269.17 1287.61 1316.78 1319.21 1334.85 1338.21 1351.15 1361.04 1376.26 1389.00 1409.06 1420.53 1433.37 1442.21 1455.29 1470.87 1474.04 1495.06 1504.49 1505.52 1521.80 1532.19 1534.69 1591.03 1653.04 1659.23 1682.05 1697.58 3039.12 3071.19 3074.99 3113.88 3152.26 3158.86 3161.73 3175.18 3212.69 3224.55 3231.01 3234.73 3242.73 3244.28 3249.44 3275.76 3281.04 3768.29
frequency: 12.44 17.97 23.01 31.85 41.17 62.33 65.84 86.38 98.57 118.51 141.64 153.13 177.21 186.58 190.65 228.78 241.70 263.32 282.37 300.91 306.16 332.41 346.85 375.60 384.36 401.59 424.22 430.27 456.36 467.78 481.80 500.73 536.44 557.63 594.27 622.82 633.50 644.78 659.84 687.21 689.35 704.62 709.28 738.50 751.22 780.97 818.08 840.00 843.32 859.43 871.74 880.26 889.37 894.64 899.44 916.93 937.82 963.58 969.56 980.81 993.34 1001.48 1015.94 1026.58 1034.32 1052.09 1093.00 1098.04 1103.19 1116.57 1129.72 1136.67 1152.18 1159.40 1168.61 1175.88 1176.65 1180.42 1203.34 1209.82 1234.14 1253.00 1256.73 1269.17 1287.61 1316.78 1319.21 1334.85 1338.21 1351.15 1361.04 1376.26 1389.00 1409.06 1420.53 1433.37 1442.21 1455.29 1470.87 1474.04 1495.06 1504.49 1505.52 1521.80 1532.19 1534.69 1591.03 1653.04 1659.23 1682.05 1697.58 3039.12 3071.19 3074.99 3113.88 3152.26 3158.86 3161.73 3175.18 3212.69 3224.55 3231.01 3234.73 3242.73 3244.28 3249.44 3275.76 3281.04 3768.29
formula: C19H18Cl2N3O3
InChI: InChI=1S/C19H18Cl2N3O3/c1-13-9-25-19(27-13,10-24-12-22-11-23-24)17-7-6-16(8-18(17)21)26-15-4-2-14(20)3-5-15/h2-8,11-13,26H,9-10H2,1H3
45 atoms
Cl 1.382564 -1.713953 2.226145
Cl -7.478877 2.059254 -0.04207
O  3.263067 -1.03437 -0.015916
O  2.562251 0.390456 -1.619114
O  -3.094028 -1.856792 -0.132562
N  3.843645 1.680412 0.621906
N  4.145647 2.707876 -0.196258
N  5.995968 1.944028 0.832771
C  2.332529 -0.032514 -0.303675
C  3.935846 -1.408753 -1.227807
C  2.515101 1.140646 0.680002
C  3.814249 -0.135982 -2.045013
C  0.888983 -0.554215 -0.212207
C  5.340471 -1.854429 -0.912854
C  0.41013 -1.293122 0.871482
C  0.008703 -0.253904 -1.248559
C  -0.913722 -1.722066 0.910014
C  -1.310845 -0.672907 -1.245262
C  -1.714126 -1.39596 -0.153275
C  4.962363 1.239374 1.2225
C  5.443254 2.830785 -0.033729
C  -4.178318 -0.873006 -0.08579
C  -4.15413 0.095943 0.889941
C  -5.148116 -0.99642 -1.050352
C  -5.193727 1.009317 0.897334
C  -6.18449 -0.077042 -1.027882
C  -6.200167 0.918492 -0.058675
H  3.36816 -2.216753 -1.702667
H  2.311143 0.805117 1.695324
H  1.820659 1.936546 0.418069
H  4.618503 0.570286 -1.822364
H  3.762665 -0.306874 -3.117804
H  5.853243 -2.144884 -1.830236
H  5.90324 -1.048561 -0.44121
H  5.32967 -2.714439 -0.245148
H  0.387461 0.31412 -2.085806
H  -1.273633 -2.287604 1.760504
H  -1.983259 -0.44228 -2.059741
H  4.966373 0.416434 1.919545
H  6.010885 3.58889 -0.548928
H  -3.354457 0.15595 1.616401
H  -5.10369 -1.777711 -1.796816
H  -5.225003 1.792684 1.641269
H  -6.974811 -0.129078 -1.763263
H  -3.225806 -2.59233 0.481912
totalener: -2044.97586720 hartree
nucrepener: 2718.85495351 hartree
electener: -4763.83082071 hartree
oneelecener: -8183.42700008 hartree
twoeener: 3419.59617937 hartree
kineticenergy: 2038.90240415 hartree
xcener: -150.019100399530 hartree
chargesum: 1.0000000
charge: 0.010622 0.015081 -0.354105 -0.357299 0.027775 0.110638 -0.311620 -0.320882 0.534446 0.141200 -0.133093 -0.016184 -0.113458 -0.260226 -0.001421 -0.062621 -0.122688 -0.156857 0.142055 0.012965 0.068269 0.093691 -0.122727 -0.175781 -0.055385 -0.036095 0.020352 0.076090 0.139627 0.121074 0.094181 0.105535 0.095346 0.097637 0.097238 0.160037 0.118006 0.151698 0.153001 0.141987 0.155523 0.164211 0.150699 0.151604 0.249852
charge: 0.494222 0.483102 0.253517 0.259650 0.661755 0.225725 0.061535 0.112021 -0.378752 -0.172440 -0.038907 -0.076120 -0.051339 0.021667 -0.360737 0.054435 -0.034636 0.013513 -0.124017 -0.190123 -0.238854 -0.124873 0.012411 0.014390 0.007584 0.007491 -0.379235 0.018483 0.025010 0.040974 0.020548 0.022062 0.025911 0.022836 0.021096 0.040019 0.031780 0.039876 0.014571 0.009973 0.040310 0.041727 0.039676 0.039856 -0.007694
qa: 0.0106 0.0151 -0.3541 -0.3573 0.0278 0.1106 -0.3116 -0.3209 0.5344 0.1412 -0.1331 -0.0162 -0.1135 -0.2602 -0.0014 -0.0626 -0.1227 -0.1569 0.1421 0.0130 0.0683 0.0937 -0.1227 -0.1758 -0.0554 -0.0361 0.0204 0.0761 0.1396 0.1211 0.0942 0.1055 0.0953 0.0976 0.0972 0.1600 0.1180 0.1517 0.1530 0.1420 0.1555 0.1642 0.1507 0.1516 0.2499
va: 1.3280 1.3189 2.0097 2.0083 2.5540 3.3207 2.8302 3.0209 3.8580 3.8616 3.8397 3.9916 3.7263 3.9702 4.1915 3.9586 4.0327 4.0734 3.7113 4.0634 4.0262 3.6938 4.0346 4.0683 3.9647 3.9350 4.1024 1.0036 1.0110 1.0250 0.9992 1.0058 1.0071 1.0076 1.0049 1.0291 1.0290 1.0009 1.0046 1.0007 0.9980 0.9996 1.0049 1.0026 0.9966
dispcorr: -0.025502430 hartree
energy: -2045.001478368911
dipole: 25.24883 -30.30412 -5.05529 -6.39174 3.57989 -2.81185 -10.66606 10.24988 -0.41618
magnitude: 5.79963 au
magnitude: 14.74148 debye
temp: 298.15 k
press: 1.00 atm
zeropoint: 0.35133004 hartree
thermalvibcorrection: 0.02063484 hartree
thermalrotcorrection: 0.00141627 hartree
thermaltrasncorrection: 0.00141627 hartree
thermaltotal: -2044.62668095 hartree
thermalcorr: 0.02346738 hartree
nonthermalcorr: 0.35133004 hartree
totalcorr: 0.37479742 hartree
thermalcorrenthalpy: 0.00094421 hartree
totalenthalpy: -2044.62573674 hartree
totalentropycorr: -0.07567165 hartree
gibbsenthalpy: -2044.70140839 hartree
gibbsminuselec: 0.30006998 hartree
