program: Orca
programVersion: 5.0.2
elementType: Cl Cl O O O N N N C C C C C C C C C C C C C C C C C C C H H H H H H H H H H H H H H H H H H
charge: 1
multiplicity: 1
keywords: wB97X-D3 TightOpt Freq def2-TZVPP def2/J RIJCOSX TightSCF defgrid3
frequency: 0.00 0.00 0.00 0.00 0.00 0.00 10.20 13.70 27.40 37.24 39.19 46.50 62.69 78.03 95.87 104.87 128.41 165.34 171.49 187.10 201.36 226.13 252.49 269.01 287.62 311.86 326.46 339.16 357.56 381.53 390.24 396.48 426.18 429.95 445.34 457.83 473.32 500.35 540.00 570.25 589.27 613.38 641.24 668.24 688.49 691.94 705.04 712.13 744.70 747.52 767.67 769.75 807.38 815.97 845.51 850.58 861.70 876.66 883.81 898.68 906.08 906.48 925.86 958.29 970.03 981.25 995.82 1017.74 1022.33 1030.12 1042.34 1057.46 1061.35 1100.66 1104.90 1114.81 1120.40 1136.20 1141.22 1151.16 1159.96 1175.81 1178.96 1185.81 1196.95 1207.00 1230.78 1247.62 1268.15 1275.23 1286.31 1315.10 1320.45 1335.32 1338.36 1351.58 1352.32 1373.83 1384.86 1395.96 1406.83 1429.77 1431.99 1456.70 1468.77 1474.81 1494.79 1500.55 1504.86 1523.04 1524.74 1534.79 1588.93 1654.42 1661.66 1684.23 1696.49 3052.08 3066.25 3108.56 3125.65 3146.33 3160.10 3165.44 3193.68 3215.78 3222.32 3229.16 3234.48 3240.49 3243.88 3245.53 3269.45 3279.79 3767.28
frequency: 10.20 13.70 27.40 37.24 39.19 46.50 62.69 78.03 95.87 104.87 128.41 165.34 171.49 187.10 201.36 226.13 252.49 269.01 287.62 311.86 326.46 339.16 357.56 381.53 390.24 396.48 426.18 429.95 445.34 457.83 473.32 500.35 540.00 570.25 589.27 613.38 641.24 668.24 688.49 691.94 705.04 712.13 744.70 747.52 767.67 769.75 807.38 815.97 845.51 850.58 861.70 876.66 883.81 898.68 906.08 906.48 925.86 958.29 970.03 981.25 995.82 1017.74 1022.33 1030.12 1042.34 1057.46 1061.35 1100.66 1104.90 1114.81 1120.40 1136.20 1141.22 1151.16 1159.96 1175.81 1178.96 1185.81 1196.95 1207.00 1230.78 1247.62 1268.15 1275.23 1286.31 1315.10 1320.45 1335.32 1338.36 1351.58 1352.32 1373.83 1384.86 1395.96 1406.83 1429.77 1431.99 1456.70 1468.77 1474.81 1494.79 1500.55 1504.86 1523.04 1524.74 1534.79 1588.93 1654.42 1661.66 1684.23 1696.49 3052.08 3066.25 3108.56 3125.65 3146.33 3160.10 3165.44 3193.68 3215.78 3222.32 3229.16 3234.48 3240.49 3243.88 3245.53 3269.45 3279.79 3767.28
formula: C19H18Cl2N3O3
InChI: InChI=1S/C19H18Cl2N3O3/c1-13-9-25-19(27-13,10-24-12-22-11-23-24)17-7-6-16(8-18(17)21)26-15-4-2-14(20)3-5-15/h2-8,11-13,26H,9-10H2,1H3
45 atoms
Cl 2.075824 -1.837718 2.18208
Cl -6.698766 1.199311 0.250046
O  4.076481 -0.541788 0.403058
O  3.39707 0.831528 -1.243375
O  -2.062841 -2.304183 -0.690891
N  1.540774 2.113871 0.62677
N  0.32536 1.788568 1.11403
N  0.154359 3.466511 -0.375091
C  3.002854 0.234383 -0.040433
C  5.105977 -0.566377 -0.599329
C  2.71691 1.353983 0.974801
C  4.370254 -0.031167 -1.821489
C  1.731799 -0.608438 -0.244057
C  6.288648 0.272648 -0.166346
C  1.239258 -1.485434 0.723689
C  0.964776 -0.368712 -1.378879
C  -0.010265 -2.073632 0.571596
C  -0.280408 -0.943828 -1.564392
C  -0.719008 -1.76582 -0.560806
C  1.412934 3.111131 -0.262864
C  -0.467049 2.631355 0.488468
C  -3.202452 -1.410168 -0.43409
C  -3.098722 -0.459701 0.553705
C  -4.303013 -1.602229 -1.233336
C  -4.20095 0.35346 0.758537
C  -5.398705 -0.784705 -1.010276
C  -5.341719 0.185815 -0.017631
H  5.397729 -1.6085 -0.731493
H  3.584939 2.009873 0.99763
H  2.565865 0.92951 1.963389
H  4.992265 0.561613 -2.487234
H  3.883502 -0.831606 -2.38747
H  7.105452 0.172266 -0.881961
H  6.015065 1.326854 -0.101258
H  6.646306 -0.054647 0.80855
H  1.347263 0.320135 -2.118612
H  -0.404893 -2.715616 1.348934
H  -0.884431 -0.7324 -2.435447
H  2.253068 3.534876 -0.789902
H  -1.530096 2.65648 0.66957
H  -2.196319 -0.32804 1.136723
H  -4.313585 -2.355898 -2.009048
H  -4.175422 1.117416 1.522775
H  -6.291011 -0.894228 -1.610121
H  -2.157971 -3.153735 -0.23774
totalener: -2044.97857750 hartree
nucrepener: 2842.07332132 hartree
electener: -4887.05189881 hartree
oneelecener: -8429.49809246 hartree
twoeener: 3542.44619365 hartree
kineticenergy: 2038.91303092 hartree
xcener: -150.020730471397 hartree
chargesum: 1.0000000
charge: 0.013530 0.010221 -0.343694 -0.356632 0.029649 0.104701 -0.333841 -0.319078 0.553357 0.163291 -0.131165 -0.050295 -0.124322 -0.275464 -0.013253 -0.041767 -0.115937 -0.197089 0.148293 0.060781 0.082338 0.113543 -0.127174 -0.181687 -0.076559 -0.042843 0.030073 0.083146 0.123870 0.141870 0.110160 0.098872 0.094436 0.084699 0.104002 0.158128 0.121067 0.152408 0.154461 0.117693 0.168918 0.160126 0.150635 0.149535 0.246999
charge: 0.499386 0.478414 0.254646 0.255754 0.658688 0.230469 0.050430 0.116134 -0.383826 -0.162680 -0.023584 -0.081053 -0.058312 0.014838 -0.361328 0.045880 -0.030670 0.017126 -0.126860 -0.172333 -0.251702 -0.115562 0.015548 0.011916 0.004316 0.006096 -0.380183 0.025737 0.039150 0.034334 0.027353 0.012667 0.022865 0.016159 0.022813 0.039344 0.033206 0.041118 0.018856 0.002828 0.042689 0.040073 0.038746 0.039161 -0.008648
qa: 0.0135 0.0102 -0.3437 -0.3566 0.0296 0.1047 -0.3338 -0.3191 0.5534 0.1633 -0.1312 -0.0503 -0.1243 -0.2755 -0.0133 -0.0418 -0.1159 -0.1971 0.1483 0.0608 0.0823 0.1135 -0.1272 -0.1817 -0.0766 -0.0428 0.0301 0.0831 0.1239 0.1419 0.1102 0.0989 0.0944 0.0847 0.1040 0.1581 0.1211 0.1524 0.1545 0.1177 0.1689 0.1601 0.1506 0.1495 0.2470
va: 1.3360 1.3143 2.0461 1.9945 2.5682 3.3027 2.8097 3.0633 3.8809 3.9092 3.8798 3.9872 3.7470 3.9630 4.2286 3.8265 4.0344 4.1485 3.6798 4.0633 4.0254 3.7047 3.9865 4.0964 3.9763 3.9509 4.0930 0.9972 1.0176 1.0231 1.0014 0.9944 1.0094 1.0055 1.0097 1.0199 1.0265 1.0015 1.0066 1.0071 1.0016 0.9998 1.0048 1.0037 0.9972
dispcorr: -0.027670553 hartree
energy: -2045.006754568368
dipole: 27.80940 -28.92033 -1.11094 0.79767 -3.84127 -3.04359 -10.52696 9.30808 -1.21888
magnitude: 3.46169 au
magnitude: 8.79892 debye
temp: 298.15 k
press: 1.00 atm
zeropoint: 0.35142841 hartree
thermalvibcorrection: 0.02060756 hartree
thermalrotcorrection: 0.00141627 hartree
thermaltrasncorrection: 0.00141627 hartree
thermaltotal: -2044.63188605 hartree
thermalcorr: 0.02344011 hartree
nonthermalcorr: 0.35142841 hartree
totalcorr: 0.37486852 hartree
thermalcorrenthalpy: 0.00094421 hartree
totalenthalpy: -2044.63094184 hartree
totalentropycorr: -0.07551504 hartree
gibbsenthalpy: -2044.70645688 hartree
gibbsminuselec: 0.30029769 hartree
