program: Orca
programVersion: 5.0.2
elementType: Cl Cl O O O N N N C C C C C C C C C C C C C C C C C C C H H H H H H H H H H H H H H H H H H
charge: 1
multiplicity: 1
keywords: wB97X-D3 TightOpt Freq def2-TZVPP def2/J RIJCOSX TightSCF defgrid3
frequency: 0.00 0.00 0.00 0.00 0.00 0.00 11.50 23.64 28.00 29.91 32.00 46.92 55.21 75.49 92.75 105.59 131.58 170.73 176.84 187.54 190.33 221.10 263.47 271.79 274.57 290.41 310.70 342.91 362.50 382.14 407.34 418.28 433.59 439.57 461.45 478.03 501.25 531.57 556.93 600.04 632.10 639.19 644.17 653.57 668.93 693.65 711.42 714.31 718.42 754.67 763.56 769.44 805.68 843.92 855.60 865.64 885.89 894.80 897.69 911.06 923.41 925.52 946.58 961.61 966.01 988.23 997.59 1012.27 1013.62 1028.22 1044.19 1051.29 1066.20 1089.84 1118.27 1128.66 1130.93 1136.05 1136.72 1148.83 1172.17 1175.77 1183.07 1192.45 1211.76 1231.57 1244.85 1250.37 1269.95 1274.77 1287.99 1302.85 1318.69 1325.24 1336.97 1341.35 1363.47 1378.29 1384.50 1421.02 1424.60 1444.58 1455.56 1462.72 1480.48 1490.26 1492.55 1503.86 1530.72 1538.58 1548.58 1617.04 1625.64 1640.79 1666.80 1674.14 1691.84 3050.96 3073.69 3077.48 3136.30 3141.00 3154.82 3166.41 3214.49 3218.47 3220.10 3223.47 3234.97 3236.23 3239.02 3240.01 3304.19 3309.05 3668.97
frequency: 11.50 23.64 28.00 29.91 32.00 46.92 55.21 75.49 92.75 105.59 131.58 170.73 176.84 187.54 190.33 221.10 263.47 271.79 274.57 290.41 310.70 342.91 362.50 382.14 407.34 418.28 433.59 439.57 461.45 478.03 501.25 531.57 556.93 600.04 632.10 639.19 644.17 653.57 668.93 693.65 711.42 714.31 718.42 754.67 763.56 769.44 805.68 843.92 855.60 865.64 885.89 894.80 897.69 911.06 923.41 925.52 946.58 961.61 966.01 988.23 997.59 1012.27 1013.62 1028.22 1044.19 1051.29 1066.20 1089.84 1118.27 1128.66 1130.93 1136.05 1136.72 1148.83 1172.17 1175.77 1183.07 1192.45 1211.76 1231.57 1244.85 1250.37 1269.95 1274.77 1287.99 1302.85 1318.69 1325.24 1336.97 1341.35 1363.47 1378.29 1384.50 1421.02 1424.60 1444.58 1455.56 1462.72 1480.48 1490.26 1492.55 1503.86 1530.72 1538.58 1548.58 1617.04 1625.64 1640.79 1666.80 1674.14 1691.84 3050.96 3073.69 3077.48 3136.30 3141.00 3154.82 3166.41 3214.49 3218.47 3220.10 3223.47 3234.97 3236.23 3239.02 3240.01 3304.19 3309.05 3668.97
formula: C19H18Cl2N3O3
InChI: InChI=1S/C19H18Cl2N3O3/c1-13-9-25-19(27-13,10-24-12-22-11-23-24)17-7-6-16(8-18(17)21)26-15-4-2-14(20)3-5-15/h2-8,11-13,22H,9-10H2,1H3
45 atoms
Cl 2.543879 -0.736439 2.686291
Cl -7.239552 -0.11173 -1.38642
O  3.6355 -1.491955 -0.116279
O  2.835856 -0.29616 -1.838996
O  -2.324598 -0.301876 1.801205
N  3.086852 2.096077 -0.284895
N  2.637303 2.907235 0.697551
N  2.091623 3.688812 -1.266773
C  2.907921 -0.351767 -0.421564
C  3.281515 -2.4626 -1.106063
C  3.76104 0.840085 0.033683
C  3.173344 -1.590023 -2.353386
C  1.502255 -0.339097 0.178847
C  4.323601 -3.548191 -1.152346
C  1.257813 -0.499758 1.548639
C  0.395252 -0.156712 -0.640911
C  -0.023297 -0.485112 2.05868
C  -0.901338 -0.136324 -0.153658
C  -1.110125 -0.305958 1.2082
C  2.759876 2.552588 -1.471767
C  2.03412 3.875069 0.084514
C  -3.463076 -0.255694 1.011576
C  -4.127517 0.947483 0.863656
C  -3.951085 -1.418973 0.442708
C  -5.297595 0.993067 0.122555
C  -5.118159 -1.374444 -0.301159
C  -5.782766 -0.1674 -0.459582
H  2.299806 -2.876802 -0.852357
H  4.718691 0.806359 -0.480081
H  3.91087 0.833092 1.108156
H  4.125953 -1.524027 -2.88236
H  2.393817 -1.918903 -3.039539
H  4.074068 -4.274066 -1.926465
H  5.306212 -3.128962 -1.368728
H  4.368701 -4.071419 -0.199023
H  0.55552 -0.043903 -1.704269
H  -0.195544 -0.619534 3.117121
H  -1.73556 -0.003868 -0.827619
H  2.975456 2.072918 -2.411807
H  1.55573 4.712314 0.564154
H  -3.736269 1.837105 1.339034
H  -3.424291 -2.352696 0.589918
H  -5.836685 1.922481 0.002034
H  -5.518532 -2.273061 -0.749593
H  1.706627 4.285906 -1.981346
totalener: -2045.05100583 hartree
nucrepener: 2769.45770783 hartree
electener: -4814.50871366 hartree
oneelecener: -8286.11494919 hartree
twoeener: 3471.60623553 hartree
kineticenergy: 2038.96839909 hartree
xcener: -150.056502608249 hartree
chargesum: 1.0000000
charge: -0.032563 -0.047939 -0.307588 -0.417315 -0.280162 0.127556 -0.218930 -0.117508 0.566186 0.093501 -0.146535 0.005826 -0.203388 -0.237046 0.020515 -0.134374 -0.179879 -0.198372 0.255475 0.152975 0.151399 0.203113 -0.171421 -0.155308 -0.110587 -0.111643 0.069256 0.087702 0.142186 0.164022 0.090617 0.106034 0.092206 0.079821 0.107565 0.140730 0.132117 0.140189 0.211366 0.190471 0.129222 0.137919 0.131322 0.134306 0.206962
charge: 0.457379 0.422694 0.275861 0.218483 0.345166 0.286812 0.147233 0.410621 -0.388324 -0.170552 0.007551 -0.071748 -0.119545 0.024609 -0.370037 -0.007473 -0.015119 -0.012183 -0.191440 -0.023299 -0.105127 -0.196069 -0.002075 0.001919 -0.024002 -0.021580 -0.394872 0.024536 0.040929 0.031751 0.016870 0.019083 0.026482 0.020516 0.025987 0.021986 0.034882 0.028270 0.039741 0.035197 0.029225 0.032427 0.028235 0.029583 0.029417
qa: -0.0326 -0.0479 -0.3076 -0.4173 -0.2802 0.1276 -0.2189 -0.1175 0.5662 0.0935 -0.1465 0.0058 -0.2034 -0.2370 0.0205 -0.1344 -0.1799 -0.1984 0.2555 0.1530 0.1514 0.2031 -0.1714 -0.1553 -0.1106 -0.1116 0.0693 0.0877 0.1422 0.1640 0.0906 0.1060 0.0922 0.0798 0.1076 0.1407 0.1321 0.1402 0.2114 0.1905 0.1292 0.1379 0.1313 0.1343 0.2070
va: 1.2966 1.2549 2.0640 1.9265 2.1343 3.4550 2.8936 3.5471 3.8586 3.9233 3.7911 3.9153 3.5857 3.9711 4.0859 3.8769 4.0843 4.0273 3.9094 3.9288 3.9164 3.8062 4.0291 4.0150 3.9738 3.9747 3.9808 1.0027 1.0199 1.0298 1.0072 0.9987 1.0054 1.0107 1.0055 1.0262 1.0252 1.0112 0.9970 0.9806 1.0087 1.0037 1.0093 1.0084 0.9931
dispcorr: -0.025033701 hartree
energy: -2045.076168620136
dipole: 23.76193 -19.97813 3.78380 -5.22508 8.74199 3.51691 -13.21303 10.54696 -2.66606
magnitude: 5.81323 au
magnitude: 14.77607 debye
temp: 298.15 k
press: 1.00 atm
zeropoint: 0.35290832 hartree
thermalvibcorrection: 0.02044988 hartree
thermalrotcorrection: 0.00141627 hartree
thermaltrasncorrection: 0.00141627 hartree
thermaltotal: -2044.69997788 hartree
thermalcorr: 0.02328242 hartree
nonthermalcorr: 0.35290832 hartree
totalcorr: 0.37619074 hartree
thermalcorrenthalpy: 0.00094421 hartree
totalenthalpy: -2044.69903367 hartree
totalentropycorr: -0.07535834 hartree
gibbsenthalpy: -2044.77439201 hartree
gibbsminuselec: 0.30177661 hartree
