program: Orca
programVersion: 5.0.2
elementType: S S P O O O O O C C C C C C H H H H H H H H H H H H H H H H
charge: 1
multiplicity: 1
keywords: wB97X-D3 TightOpt Freq def2-TZVPP def2/J RIJCOSX TightSCF defgrid3
frequency: 0.00 0.00 0.00 0.00 0.00 0.00 17.83 22.54 39.54 60.91 68.81 71.91 80.68 90.53 95.42 97.10 122.38 153.92 176.05 204.00 213.45 233.40 245.64 296.11 311.95 321.43 349.44 377.28 397.00 430.13 450.48 499.82 572.49 620.05 701.11 762.65 779.75 786.87 799.97 811.90 865.86 949.34 973.39 995.17 1039.49 1050.75 1067.90 1086.35 1117.76 1135.49 1145.43 1181.54 1184.80 1205.03 1208.49 1211.65 1250.78 1270.69 1309.76 1320.96 1346.54 1412.97 1427.77 1458.22 1474.09 1489.66 1491.74 1492.94 1495.77 1497.48 1501.24 1503.50 1506.28 1510.51 3084.65 3088.76 3092.03 3096.47 3096.66 3112.03 3149.21 3162.08 3169.14 3175.25 3186.33 3190.60 3198.04 3218.55 3224.01 3867.98
frequency: 17.83 22.54 39.54 60.91 68.81 71.91 80.68 90.53 95.42 97.10 122.38 153.92 176.05 204.00 213.45 233.40 245.64 296.11 311.95 321.43 349.44 377.28 397.00 430.13 450.48 499.82 572.49 620.05 701.11 762.65 779.75 786.87 799.97 811.90 865.86 949.34 973.39 995.17 1039.49 1050.75 1067.90 1086.35 1117.76 1135.49 1145.43 1181.54 1184.80 1205.03 1208.49 1211.65 1250.78 1270.69 1309.76 1320.96 1346.54 1412.97 1427.77 1458.22 1474.09 1489.66 1491.74 1492.94 1495.77 1497.48 1501.24 1503.50 1506.28 1510.51 3084.65 3088.76 3092.03 3096.47 3096.66 3112.03 3149.21 3162.08 3169.14 3175.25 3186.33 3190.60 3198.04 3218.55 3224.01 3867.98
formula: C6H16O5PS2
InChI: InChI=1S/C6H16O5PS2/c1-4-14(8,9)6-5-13-12(7,10-2)11-3/h7H,4-6H2,1-3H3
30 atoms
S  -2.982044 0.179245 -0.041297
S  1.089062 -1.322352 0.022209
P  2.560737 0.022365 0.308095
O  -2.91131 0.849537 1.225536
O  -2.874506 0.932231 -1.257265
O  2.397423 1.14763 -0.728018
O  3.918018 -0.710272 0.234703
O  2.54343 0.737877 1.69246
C  -1.626328 -1.008312 -0.056833
C  -4.439929 -0.830681 -0.096006
C  -0.349642 -0.183557 -0.012331
C  -5.682021 0.051741 -0.081779
C  3.046291 2.452468 -0.664377
C  4.408824 -1.44672 -0.920198
H  -1.731076 -1.649995 0.817569
H  -1.701456 -1.599285 -0.969309
H  -4.373652 -1.425686 -1.007502
H  -4.398034 -1.488339 0.77287
H  -0.335132 0.432108 0.885371
H  -0.267505 0.44488 -0.895625
H  -6.567461 -0.58021 -0.117003
H  -5.723621 0.652073 0.825233
H  -5.698868 0.71576 -0.944101
H  4.122696 2.322102 -0.580617
H  2.651697 3.002991 0.184732
H  2.791374 2.944559 -1.595857
H  4.24704 -0.865241 -1.825246
H  3.898982 -2.405025 -0.976737
H  5.468906 -1.590254 -0.744129
H  2.712753 0.213829 2.481618
totalener: -1752.08221120 hartree
nucrepener: 1427.59319512 hartree
electener: -3179.67540632 hartree
oneelecener: -5232.17411589 hartree
twoeener: 2052.49870957 hartree
kineticenergy: 1747.43942989 hartree
xcener: -111.785983090569 hartree
chargesum: 1.0000000
charge: 0.776547 -0.049665 0.800127 -0.461767 -0.458925 -0.274870 -0.284152 -0.265273 -0.229881 -0.134935 -0.146943 -0.253952 -0.117565 -0.127756 0.137893 0.140720 0.112093 0.111113 0.153668 0.158372 0.098422 0.110886 0.111118 0.133982 0.145279 0.148188 0.136416 0.139311 0.149610 0.241941
charge: 0.742072 0.516911 0.117834 -0.259848 -0.257799 0.132163 0.126169 0.237860 -0.165821 -0.148643 -0.234878 0.005064 0.011413 -0.001187 0.016495 0.017179 0.017090 0.016875 0.013551 0.014698 0.022867 0.021683 0.021799 0.013093 0.016565 0.024828 0.012366 0.013346 0.025306 -0.089049
qa: 0.7765 -0.0497 0.8001 -0.4618 -0.4589 -0.2749 -0.2842 -0.2653 -0.2299 -0.1349 -0.1469 -0.2540 -0.1176 -0.1278 0.1379 0.1407 0.1121 0.1111 0.1537 0.1584 0.0984 0.1109 0.1111 0.1340 0.1453 0.1482 0.1364 0.1393 0.1496 0.2419
va: 5.6397 2.4174 5.4723 2.0191 2.0223 2.2130 2.2218 2.3032 3.9136 3.8771 3.8876 3.9615 3.7892 3.8157 1.0150 1.0140 1.0096 1.0099 1.0207 1.0197 1.0010 1.0089 1.0089 0.9879 0.9893 0.9870 0.9835 0.9852 0.9879 1.0220
dispcorr: -0.012448579 hartree
energy: -1752.094667948266
dipole: -7.16834 10.70913 3.54079 -0.70462 -0.59485 -1.29947 -3.81970 3.85170 0.03200
magnitude: 3.77184 au
magnitude: 9.58726 debye
temp: 298.15 k
press: 1.00 atm
zeropoint: 0.24046889 hartree
thermalvibcorrection: 0.01651247 hartree
thermalrotcorrection: 0.00141627 hartree
thermaltrasncorrection: 0.00141627 hartree
thermaltotal: -1751.83485405 hartree
thermalcorr: 0.01934501 hartree
nonthermalcorr: 0.24046889 hartree
totalcorr: 0.25981390 hartree
thermalcorrenthalpy: 0.00094421 hartree
totalenthalpy: -1751.83390984 hartree
totalentropycorr: -0.06691319 hartree
gibbsenthalpy: -1751.90082303 hartree
gibbsminuselec: 0.19384492 hartree
