program: Gaussian 09
title: 000044778
version: EM64L-G09RevD.01
frameworkgroup: C1[X(C8H11NO3)]
method: RPBEPBE
basis: SDD
operation: Freq
keyword: #p
keyword: freq=noraman
keyword: PBEPBE/SDD
title: #p freq=noraman PBEPBE/SDD
converged: YES YES NO NO
title: Mulliken charges:
elementType: O O O N C C C C C C C C H H H H H H H H H H H
charge: -0.290760 -0.454828 -0.303137 -0.352178 -0.252414 0.358684 0.190132 -0.341973 -0.388042 -0.653413 -0.251268 -0.169813 0.245828 0.222073 0.258562 0.344614 0.286417 0.233382 0.208541 0.222808 0.254868 0.257572 0.374344
chargesum: 0.00000
title: Mulliken charges with hydrogens summed into heavy atoms:
elementType: O O O N C C C C C C C C
charge: -0.290760 -0.080484 -0.303137 -0.007563 -0.006586 0.358684 0.190132 0.138662 -0.101625 0.011318 0.003600 0.087759
polarizability: 1.18436756e+02 1.77198404e+00 1.11055361e+02 7.18356926e+00 -4.73966872e+00 6.76341756e+01
1716.lowfreq: 0.0003 0.0006 0.0008 4.8208 8.7905 13.4873 33.3419 53.3126 68.7872
frequency: 33.0996 53.2847 68.7534 91.6766 106.2659 178.6141 194.0918 245.7137 295.3567 332.7670 354.2147 412.4366 467.3105 541.8095 571.9091 587.9067 619.6478 685.5784 710.8483 713.8762 786.1003 801.7868 833.8547 867.7252 879.3695 887.1467 893.8962 912.7403 983.2507 1035.1199 1041.4829 1077.2406 1105.5761 1128.5986 1150.5951 1157.3055 1201.9451 1213.7775 1246.0336 1281.8228 1299.7410 1352.4462 1356.2933 1382.7326 1393.0630 1471.7482 1476.2610 1484.8402 1496.1063 1529.7419 1601.9773 1632.2835 2934.7888 2985.0110 2994.7024 3069.8888 3088.8218 3099.3376 3223.3851 3252.0268 3269.4253 3328.8813 3491.9744
redmass: 2.6006 4.3286 7.7029 3.4554 4.2494 2.9709 2.7438 1.7314 3.2291 4.8404 7.1034 3.3274 3.3516 1.5330 3.5057 3.3258 3.8547 1.2226 1.3718 2.4406 1.7294 2.2214 1.5180 6.2633 2.2338 1.6126 2.6046 3.4910 2.0691 2.5337 4.0884 3.2354 2.2032 1.4768 1.7986 3.2302 1.3586 1.3608 2.1844 1.1327 1.4165 2.0506 1.3987 1.4806 1.2181 1.0465 1.0499 1.0813 5.0873 1.7137 7.4093 6.8325 1.0813 1.0361 1.0668 1.0979 1.0973 1.1016 1.0917 1.0990 1.1090 1.0640 1.0783
irintensity: 0.1804 1.6252 2.3278 2.6638 0.1530 3.2959 2.6282 6.8615 3.3923 21.0528 26.2741 2.3907 4.7646 49.2683 60.9136 5.8513 15.4586 109.3944 91.0705 34.6879 1.8980 15.6906 23.2876 2.9665 3.5194 1.5791 5.3416 41.3809 40.8325 0.4813 42.7796 11.8066 13.9313 36.2383 27.4916 14.9737 34.8325 8.6773 88.7665 34.4584 25.2035 6.9714 5.9446 149.4841 21.8885 18.1972 4.2755 20.8725 17.7868 155.2940 39.2934 155.8900 32.8672 26.6328 36.8008 9.8696 33.3274 30.9562 2.8173 1.0010 0.4261 91.0789 61.9267
temp: 298.150 k
press: 1.00000 atm
elementType: 8 8 8 7 6 6 6 6 6 6 6 6 1 1 1 1 1 1 1 1 1 1 1
symmnumber: 1
zpe: 478302.9 jmol-1
zpe.correction: 0.182176 hartree
zpe.thermalcorrener: 0.194230 hartree
zpe.thermalcorrenthalpy: 0.195175 hartree
zpe.thermalcorrgfe: 0.142563 hartree
zpe.sumelectzpe: -590.940261 hartree
zpe.sumelectthermal: -590.928207 hartree
zpe.sumelectthermalent: -590.927263 hartree
zpe.sumelectthermalfe: -590.979874 hartree
dipole: 0.6475 -4.5677 -0.1338
dipole: 4.6153
quadrupole: -63.9009 -72.6925 -72.1429
quadrupole: -1.2325 4.2857 -0.1678
quadrupole: 5.6779 -3.1138 -2.5641 -1.2325 4.2857 -0.1678
hfenergy: -591.1224372 hartree
pointgroup: C01 [X(C8H11N1O3)]
dipole: -0.1988441 -1.5656128 -0.8980518 debye
dipolederiv: -0.675668 0.0880591 -0.1984112 0.0912809 -0.3022042 -0.102135 -0.2021819 -0.1334252 -0.392504 -0.467582 -0.0212623 -0.1050997 0.0850836 -0.6782474 -0.1387216 0.0309794 -0.0656092 -0.4929689 -0.6919071 0.1514896 0.2731838 -0.1975384 -0.7023023 -0.2195825 0.1329285 -0.4674542 -0.7727529 -0.8082664 -0.3088817 -0.2174973 -0.3552592 -0.8065822 -0.2233203 -0.2093566 -0.2025515 -0.5417924 0.0248156 -0.0831678 0.1460895 -0.2033418 0.4710842 0.0614294 0.115028 0.1349623 0.3966565 0.3413268 -0.0612844 0.1179351 -0.1792013 0.0607731 0.1631798 0.165983 0.1265895 0.1631883 0.8130909 0.0736726 -0.281016 0.6006705 0.9198773 0.4910427 -0.0967158 0.6964294 0.8391425 0.5789446 0.2281004 0.108498 0.1325999 0.3161123 -0.0574446 -0.0404709 -0.1676992 0.139054 -0.2602241 0.0327916 0.030095 0.043613 -0.0803092 0.0807231 -0.0118515 0.0942683 -0.0877411 -0.061067 -0.0578579 -0.0818795 -0.0460116 0.0402167 0.0208714 -0.0679169 0.0396733 0.0159366 -0.0515406 -0.0842904 0.0369227 -0.118574 -0.0345022 0.0527332 -0.047165 0.1052243 -0.1152135 0.2713518 -0.1633498 0.1490295 -0.0732172 -0.047941 0.0597755 0.2425173 0.0204488 0.0024139 -0.0295036 0.0259848 -0.0538638 0.0517651 -0.0086359 0.0112109 -0.0699406 0.018356 -0.1223194 -0.0363595 0.0200014 -0.0658693 -0.0257642 -0.1559663 0.0832618 -0.0150072 0.0722558 0.0660651 0.057035 -0.0097116 0.0038301 0.0591431 0.085386 -0.0824678 0.0610119 -0.0211257 -0.0023279 0.3625361 -0.0704661 0.0476474 -0.0582683 0.1812199 -0.0561263 0.0798488 -0.020387 0.2364868 0.1494547 0.0056248 -0.0345911 -0.0089038 0.1127193 -0.0793785 -0.0280959 -0.0777428 0.0961454 0.0907452 0.0402262 -0.0259997 0.0843965 -0.1032071 0.0764491 -0.0392816 0.0389651 0.0531868 0.039269 0.0723826 0.0994098 0.0549382 0.0440707 -0.0965228 0.0352419 -0.0860153 -0.0847596 -0.1200314 -0.1318121 0.0217074 -0.1328445 0.0333291 0.0238688 0.0456978 0.0303432 0.0604466 0.00188 0.0894784 -0.0356476 0.0913418 0.1204011 -0.0208825 -0.0466139 -0.0152032 0.1566578 0.1088986 0.0337113 -0.0394781 0.0490974 0.097895 -0.0964657 -0.0270501 -0.1070026 0.1023065 0.3628014 0.1305612 0.105005 0.0549944 0.4368132 0.0485017 -0.0075884 -0.0133001 0.284693 unknown
polarizability: 119.1996054|-3.1259145|94.161384|2.6542224|21.9566108|83.7653029 unknown
InChI: InChI=1S/C8H11NO3/c1-2-9-8(11)7(10)6-4-3-5-12-6/h3-5,7,9-10H,2H2,1H3
charge 0 multiplicity 1
23 atoms
O  1.121141 -0.57752 -1.058172
O  0.505105 2.408663 1.049674
O  -1.772199 1.231289 1.668194
N  -1.636002 -0.414257 0.005859
C  0.121386 1.360074 0.129116
C  1.259595 0.388469 -0.025753
C  -1.191156 0.692849 0.670018
C  -2.876304 -1.128241 0.368649
C  2.470561 0.215328 0.612566
C  -3.888145 -1.166654 -0.793874
C  3.133932 -0.906835 -0.028729
C  2.297172 -1.364755 -1.027683
H  -0.124005 1.797079 -0.864295
H  -2.621217 -2.157026 0.689611
H  -3.299349 -0.601062 1.239975
H  -1.043378 -0.796158 -0.739166
H  2.838864 0.831897 1.427925
H  -4.179848 -0.145019 -1.092843
H  -3.471234 -1.681583 -1.679367
H  -4.798698 -1.711036 -0.48476
H  4.112127 -1.312514 0.222271
H  2.351822 -2.157925 -1.767756
H  -0.241768 2.454636 1.721641
