program: Orca
programVersion: 5.0.2
elementType: Cl S O O N C C C C C C C C C C C C C C C C H H H H H H H H H H H H H H H H H
charge: 1
multiplicity: 1
keywords: wB97X-D3 TightOpt Freq def2-TZVPP def2/J RIJCOSX TightSCF defgrid3
frequency: 0.00 0.00 0.00 0.00 0.00 0.00 30.81 35.92 51.13 63.03 76.70 109.99 130.59 153.97 159.04 181.92 198.80 212.22 214.44 239.82 282.58 287.84 308.35 338.88 378.98 398.02 457.07 469.43 481.33 495.16 506.88 527.40 559.21 570.71 627.75 636.79 653.86 688.22 696.07 731.92 751.14 756.67 767.32 795.77 862.32 878.67 890.24 903.72 924.42 925.66 936.41 980.40 1010.31 1026.19 1035.36 1052.66 1075.70 1080.20 1093.87 1097.56 1104.74 1111.62 1134.31 1175.24 1175.94 1192.08 1196.11 1196.74 1198.98 1226.77 1253.56 1265.40 1276.78 1302.93 1321.17 1345.80 1355.19 1372.89 1378.18 1399.34 1417.55 1426.82 1466.22 1474.76 1488.48 1492.07 1498.00 1499.86 1506.79 1509.36 1514.71 1518.22 1535.53 1642.94 1656.37 1676.06 1833.10 3071.16 3078.90 3088.81 3101.76 3109.98 3126.46 3166.45 3170.60 3180.97 3192.51 3202.82 3220.55 3232.63 3236.54 3239.82 3277.59 3370.23
frequency: 30.81 35.92 51.13 63.03 76.70 109.99 130.59 153.97 159.04 181.92 198.80 212.22 214.44 239.82 282.58 287.84 308.35 338.88 378.98 398.02 457.07 469.43 481.33 495.16 506.88 527.40 559.21 570.71 627.75 636.79 653.86 688.22 696.07 731.92 751.14 756.67 767.32 795.77 862.32 878.67 890.24 903.72 924.42 925.66 936.41 980.40 1010.31 1026.19 1035.36 1052.66 1075.70 1080.20 1093.87 1097.56 1104.74 1111.62 1134.31 1175.24 1175.94 1192.08 1196.11 1196.74 1198.98 1226.77 1253.56 1265.40 1276.78 1302.93 1321.17 1345.80 1355.19 1372.89 1378.18 1399.34 1417.55 1426.82 1466.22 1474.76 1488.48 1492.07 1498.00 1499.86 1506.79 1509.36 1514.71 1518.22 1535.53 1642.94 1656.37 1676.06 1833.10 3071.16 3078.90 3088.81 3101.76 3109.98 3126.46 3166.45 3170.60 3180.97 3192.51 3202.82 3220.55 3232.63 3236.54 3239.82 3277.59 3370.23
formula: C16H17ClNO2S
InChI: InChI=1S/C16H17ClNO2S/c1-20-16(19)15(12-4-2-3-5-13(12)17)18-8-6-14-11(10-18)7-9-21-14/h2-5,7,9,15,18H,6,8,10H2,1H3
38 atoms
Cl -1.445618 -0.510303 2.206745
S  4.848854 0.000505 0.100829
O  -2.644238 2.508813 0.243818
O  -0.642134 2.45799 1.122225
N  0.453777 0.643228 -0.291244
C  1.284464 1.651668 -1.04045
C  0.980039 -0.737744 -0.517022
C  -1.015889 0.832804 -0.580205
C  2.669914 1.746538 -0.428431
C  2.454553 -0.764082 -0.261111
C  3.214551 0.366936 -0.226698
C  -1.845924 -0.42425 -0.480859
C  3.208606 -1.946341 -0.022817
C  -1.438135 2.004336 0.345639
C  4.52161 -1.671504 0.185638
C  -2.127438 -1.07572 0.720168
C  -2.377002 -0.956556 -1.653899
C  -2.929522 -2.204887 0.750644
C  -3.176513 -2.084687 -1.635717
C  -3.457327 -2.704627 -0.42787
C  -3.630102 2.080043 -0.702316
H  0.769721 2.607178 -0.990148
H  1.321691 1.307781 -2.074647
H  0.725481 -1.019134 -1.540749
H  0.452916 -1.408506 0.157057
H  -1.07462 1.1813 -1.612399
H  2.620366 2.296937 0.514865
H  3.296958 2.333573 -1.100356
H  2.795827 -2.944991 -0.005459
H  5.318135 -2.36879 0.389637
H  -2.166828 -0.468299 -2.598731
H  -3.131132 -2.686654 1.697414
H  -3.580075 -2.476188 -2.559382
H  -4.085366 -3.584977 -0.398938
H  -4.381106 2.862961 -0.699996
H  -4.076056 1.139065 -0.388291
H  -3.212268 1.991004 -1.704795
H  0.547125 0.88803 0.703207
totalener: -1683.39043744 hartree
nucrepener: 2019.38663102 hartree
electener: -3702.77706846 hartree
oneelecener: -6298.71183535 hartree
twoeener: 2595.93476689 hartree
kineticenergy: 1678.44474080 hartree
xcener: -120.788210232480 hartree
chargesum: 1.0000000
charge: -0.000415 0.131025 -0.183659 -0.310152 0.209904 -0.151449 -0.088808 -0.255384 -0.134411 0.030003 -0.120314 0.026804 -0.288245 0.406785 -0.084695 -0.044031 -0.111085 -0.108624 -0.138104 -0.071362 -0.132075 0.149435 0.140845 0.144366 0.145839 0.143164 0.127190 0.113873 0.142402 0.148756 0.132997 0.143451 0.154819 0.158247 0.156754 0.130487 0.105755 0.179912
charge: 0.482971 0.804468 0.350649 0.152102 0.468437 0.024769 0.019759 -0.060773 -0.028876 -0.148289 -0.332363 -0.133703 -0.055987 -0.471912 -0.242573 -0.386427 0.002160 -0.011615 0.011445 0.028131 -0.001921 0.035753 0.037506 0.040728 0.039898 0.051000 0.041713 0.045130 0.022884 0.003324 0.030573 0.035949 0.034464 0.037643 0.025982 0.015180 0.006882 0.024939
qa: -0.0004 0.1310 -0.1837 -0.3102 0.2099 -0.1514 -0.0888 -0.2554 -0.1344 0.0300 -0.1203 0.0268 -0.2882 0.4068 -0.0847 -0.0440 -0.1111 -0.1086 -0.1381 -0.0714 -0.1321 0.1494 0.1408 0.1444 0.1458 0.1432 0.1272 0.1139 0.1424 0.1488 0.1330 0.1435 0.1548 0.1582 0.1568 0.1305 0.1058 0.1799
va: 1.3579 2.8088 2.2217 2.1508 3.5388 3.9013 3.7871 4.0753 3.9063 3.5310 3.9443 3.0433 4.1309 4.2037 3.9947 4.1383 3.9080 3.9837 4.0331 3.9399 3.8697 1.0005 0.9966 0.9820 0.9993 0.9922 1.0032 1.0134 1.0092 1.0003 1.0067 1.0091 0.9962 0.9926 0.9930 0.9786 0.9860 1.0422
dispcorr: -0.022578947 hartree
energy: -1683.413048022347
dipole: -5.89328 4.96430 -0.92898 0.46443 -0.95300 -0.48857 -15.08944 12.95806 -2.13137
magnitude: 2.37580 au
magnitude: 6.03881 debye
temp: 298.15 k
press: 1.00 atm
zeropoint: 0.30984864 hartree
thermalvibcorrection: 0.01573625 hartree
thermalrotcorrection: 0.00141627 hartree
thermaltrasncorrection: 0.00141627 hartree
thermaltotal: -1683.08463058 hartree
thermalcorr: 0.01856880 hartree
nonthermalcorr: 0.30984864 hartree
totalcorr: 0.32841744 hartree
thermalcorrenthalpy: 0.00094421 hartree
totalenthalpy: -1683.08368637 hartree
totalentropycorr: -0.06451845 hartree
gibbsenthalpy: -1683.14820482 hartree
gibbsminuselec: 0.26484320 hartree
