program: Orca
programVersion: 5.0.2
elementType: Cl S O O O O N N N N N C C C C C C C C C C C C H H H H H H H H H H H H H
charge: 1
multiplicity: 1
keywords: wB97X-D3 TightOpt Freq def2-TZVPP def2/J RIJCOSX TightSCF defgrid3
frequency: 0.00 0.00 0.00 0.00 0.00 0.00 17.48 18.24 42.40 49.33 56.21 77.80 93.88 109.48 126.74 137.47 147.67 177.16 187.33 193.20 207.35 237.13 243.17 252.53 256.92 302.13 316.77 334.73 374.73 402.34 409.38 438.02 461.42 489.30 506.42 528.35 565.31 577.58 590.65 606.06 627.11 630.92 676.33 687.39 747.10 764.57 771.31 780.51 796.97 821.13 842.35 848.47 903.84 918.25 969.36 1002.04 1006.99 1016.77 1043.26 1052.91 1070.70 1072.16 1084.05 1105.05 1146.60 1159.58 1177.04 1181.96 1193.96 1198.91 1231.89 1249.36 1264.23 1296.00 1320.84 1337.95 1416.91 1433.42 1441.50 1463.50 1475.95 1480.77 1486.19 1493.93 1494.96 1498.10 1508.70 1517.00 1582.81 1623.30 1644.68 1667.69 1679.78 1738.35 1817.81 3076.06 3094.26 3145.86 3187.61 3208.72 3215.83 3221.72 3228.05 3235.86 3241.71 3349.11 3641.24 3651.29
frequency: 17.48 18.24 42.40 49.33 56.21 77.80 93.88 109.48 126.74 137.47 147.67 177.16 187.33 193.20 207.35 237.13 243.17 252.53 256.92 302.13 316.77 334.73 374.73 402.34 409.38 438.02 461.42 489.30 506.42 528.35 565.31 577.58 590.65 606.06 627.11 630.92 676.33 687.39 747.10 764.57 771.31 780.51 796.97 821.13 842.35 848.47 903.84 918.25 969.36 1002.04 1006.99 1016.77 1043.26 1052.91 1070.70 1072.16 1084.05 1105.05 1146.60 1159.58 1177.04 1181.96 1193.96 1198.91 1231.89 1249.36 1264.23 1296.00 1320.84 1337.95 1416.91 1433.42 1441.50 1463.50 1475.95 1480.77 1486.19 1493.93 1494.96 1498.10 1508.70 1517.00 1582.81 1623.30 1644.68 1667.69 1679.78 1738.35 1817.81 3076.06 3094.26 3145.86 3187.61 3208.72 3215.83 3221.72 3228.05 3235.86 3241.71 3349.11 3641.24 3651.29
formula: C12H13ClN5O4S
InChI: InChI=1S/C12H13ClN5O4S/c1-7-14-10(17-12(15-7)22-2)16-11(19)18-23(20,21)9-6-4-3-5-8(9)13/h3-6,14,16,18H,1-2H3
36 atoms
Cl -2.952184 1.958413 -1.208685
S  -2.390838 -1.379264 -0.949257
O  -2.879925 -2.707016 -0.818317
O  -2.286926 -0.731829 -2.200025
O  -0.071905 0.562447 -0.450214
O  5.939966 -0.555743 0.553103
N  -0.78849 -1.58859 -0.352608
N  1.451809 -1.092603 -0.044671
N  2.45275 1.014482 -0.145275
N  3.711711 -0.894309 0.267911
N  4.733188 1.261485 0.152305
C  -3.146369 -0.363803 0.274546
C  -3.371386 1.012226 0.160914
C  -3.558694 -1.045217 1.421586
C  -3.995872 1.674658 1.211547
C  -4.173493 -0.373762 2.456579
C  0.147706 -0.618706 -0.303794
C  -4.389139 0.99249 2.346839
C  2.558198 -0.315605 0.029775
C  3.574478 1.789609 -0.081103
C  4.765744 -0.07889 0.322288
C  3.407272 3.248771 -0.292372
C  6.112288 -1.973413 0.748658
H  -0.566183 -2.557247 -0.1842
H  -3.410129 -2.114648 1.478263
H  -4.177507 2.735995 1.115928
H  -4.494963 -0.914532 3.335792
H  -4.878993 1.532604 3.146445
H  1.634738 -2.078256 0.062479
H  4.370534 3.739181 -0.200148
H  2.992923 3.437044 -1.284325
H  2.712428 3.658663 0.442236
H  5.798035 -2.510931 -0.142837
H  5.537087 -2.301103 1.611322
H  7.1745 -2.101545 0.921801
H  1.508939 1.372211 -0.330325
totalener: -1898.07853547 hartree
nucrepener: 2286.06319966 hartree
electener: -4184.14173513 hartree
oneelecener: -7124.98742641 hartree
twoeener: 2940.84569128 hartree
kineticenergy: 1892.50810899 hartree
xcener: -136.651012367137 hartree
chargesum: 1.0000000
charge: 0.000402 0.857202 -0.418909 -0.372410 -0.399941 -0.178421 -0.215734 -0.168103 -0.144965 -0.385237 -0.261032 -0.052815 0.033063 -0.100401 -0.098969 -0.125134 0.435299 -0.102795 0.408240 0.277637 0.462701 -0.208844 -0.123470 0.155403 0.134893 0.133171 0.149992 0.151123 0.170290 0.127867 0.122403 0.118270 0.126149 0.124794 0.150827 0.217451
charge: 0.474953 0.702314 -0.216539 -0.196179 0.142617 0.378775 0.168308 0.361472 0.412006 0.155358 0.193585 -0.265599 -0.403288 -0.005770 -0.020448 0.003598 -0.468084 0.027836 -0.242639 -0.168697 -0.375270 0.062228 0.015386 -0.033537 0.029430 0.031340 0.031670 0.035650 0.012797 0.045599 0.043071 0.041336 0.014614 0.014102 0.023589 -0.025585
qa: 0.0004 0.8572 -0.4189 -0.3724 -0.3999 -0.1784 -0.2157 -0.1681 -0.1450 -0.3852 -0.2610 -0.0528 0.0331 -0.1004 -0.0990 -0.1251 0.4353 -0.1028 0.4082 0.2776 0.4627 -0.2088 -0.1235 0.1554 0.1349 0.1332 0.1500 0.1511 0.1703 0.1279 0.1224 0.1183 0.1261 0.1248 0.1508 0.2175
va: 1.3153 5.8751 2.0844 2.1497 2.1137 2.2676 3.2298 3.2873 3.4446 2.9898 3.0263 3.6559 4.0719 3.9812 3.9676 3.9890 4.2531 3.9732 4.1793 3.9314 4.2095 3.8925 3.8208 1.0412 1.0227 1.0114 0.9971 0.9935 1.0300 1.0137 0.9989 0.9996 0.9931 0.9931 0.9935 1.0525
dispcorr: -0.016332732 hartree
energy: -1898.094871592590
dipole: 17.99785 -14.02090 3.97695 -0.91011 0.83995 -0.07015 11.32545 -9.30408 2.02137
magnitude: 4.46172 au
magnitude: 11.34080 debye
temp: 298.15 k
press: 1.00 atm
zeropoint: 0.26767375 hartree
thermalvibcorrection: 0.01866856 hartree
thermalrotcorrection: 0.00141627 hartree
thermaltrasncorrection: 0.00141627 hartree
thermaltotal: -1897.80569674 hartree
thermalcorr: 0.02150110 hartree
nonthermalcorr: 0.26767375 hartree
totalcorr: 0.28917485 hartree
thermalcorrenthalpy: 0.00094421 hartree
totalenthalpy: -1897.80475253 hartree
totalentropycorr: -0.07134584 hartree
gibbsenthalpy: -1897.87609837 hartree
gibbsminuselec: 0.21877322 hartree
