program: Orca
programVersion: 5.0.2
elementType: Cl S O O O N N C C C C C C C C C C H H H H H H H H H H H H H H
charge: 1
multiplicity: 1
keywords: wB97X-D3 TightOpt Freq def2-TZVPP def2/J RIJCOSX TightSCF defgrid3
frequency: 0.00 0.00 0.00 0.00 0.00 0.00 19.34 30.05 40.44 46.70 67.09 84.64 98.23 117.09 145.95 159.09 233.89 250.65 271.69 286.13 290.83 302.98 335.60 361.12 389.07 413.88 465.84 473.14 498.25 503.30 507.77 529.32 562.82 629.06 639.00 696.18 727.91 754.02 773.91 797.27 847.27 863.74 875.90 911.93 916.94 945.45 997.50 1009.14 1028.57 1039.08 1056.75 1088.70 1122.65 1140.14 1141.98 1148.05 1156.79 1194.09 1223.91 1246.23 1296.94 1327.84 1342.18 1345.14 1352.46 1368.14 1399.24 1425.98 1432.26 1457.66 1491.93 1499.78 1507.35 1515.77 1528.65 1568.19 1634.70 1653.50 1899.95 3059.19 3063.35 3093.62 3102.50 3135.37 3152.22 3153.64 3220.02 3229.51 3242.25 3244.28 3602.85 3655.80 3776.68
frequency: 19.34 30.05 40.44 46.70 67.09 84.64 98.23 117.09 145.95 159.09 233.89 250.65 271.69 286.13 290.83 302.98 335.60 361.12 389.07 413.88 465.84 473.14 498.25 503.30 507.77 529.32 562.82 629.06 639.00 696.18 727.91 754.02 773.91 797.27 847.27 863.74 875.90 911.93 916.94 945.45 997.50 1009.14 1028.57 1039.08 1056.75 1088.70 1122.65 1140.14 1141.98 1148.05 1156.79 1194.09 1223.91 1246.23 1296.94 1327.84 1342.18 1345.14 1352.46 1368.14 1399.24 1425.98 1432.26 1457.66 1491.93 1499.78 1507.35 1515.77 1528.65 1568.19 1634.70 1653.50 1899.95 3059.19 3063.35 3093.62 3102.50 3135.37 3152.22 3153.64 3220.02 3229.51 3242.25 3244.28 3602.85 3655.80 3776.68
formula: C10H14ClN2O3S
InChI: InChI=1S/C10H14ClN2O3S/c1-2-7-12-10(14)13-17(15,16)9-5-3-8(11)4-6-9/h3-6,12-13,15H,2,7H2,1H3
31 atoms
Cl -5.851757 0.290007 -0.787591
S  0.086467 -0.46933 0.679028
O  0.521112 -1.816641 0.625764
O  0.31524 0.142774 2.095769
O  2.651671 1.949422 -0.403475
N  0.889148 0.509392 -0.274078
N  3.093757 -0.229668 0.136348
C  4.547891 -0.092786 0.236094
C  -1.580551 -0.242114 0.306455
C  5.25392 -0.234318 -1.104982
C  2.335729 0.818369 -0.187158
C  -2.204902 -1.222526 -0.461361
C  -2.251447 0.900053 0.744711
C  6.761784 -0.084552 -0.957911
C  -3.53227 -1.053085 -0.796389
C  -3.575754 1.059438 0.400518
C  -4.209835 0.084764 -0.368606
H  4.891738 -0.850077 0.941253
H  4.751362 0.883328 0.675172
H  5.013695 -1.208894 -1.538666
H  4.86575 0.52413 -1.788374
H  0.361397 1.283697 -0.657193
H  2.703505 -1.154825 0.069207
H  -1.665403 -2.104144 -0.780629
H  -1.755724 1.645728 1.352966
H  7.174891 -0.84452 -0.292413
H  7.257408 -0.185316 -1.922076
H  7.0231 0.893981 -0.552238
H  -4.047657 -1.798135 -1.385736
H  -4.126458 1.930006 0.727641
H  0.169831 -0.503433 2.802804
totalener: -1582.89940470 hartree
nucrepener: 1480.57499753 hartree
electener: -3063.47440222 hartree
oneelecener: -5092.51025298 hartree
twoeener: 2029.03585075 hartree
kineticenergy: 1578.48397200 hartree
xcener: -108.602057485353 hartree
chargesum: 1.0000000
charge: 0.036791 0.777871 -0.373787 -0.210462 -0.309840 -0.159592 -0.211274 -0.046227 -0.055992 -0.095006 0.348319 -0.094823 -0.135537 -0.242170 -0.077194 -0.073234 0.051399 0.106659 0.108616 0.060834 0.082463 0.196107 0.165029 0.163268 0.165101 0.078497 0.099153 0.086560 0.154692 0.155203 0.248576
charge: 0.508212 0.843527 -0.177179 0.197832 0.143984 0.131822 0.325536 -0.033436 -0.273124 -0.043435 -0.487912 0.019778 0.000639 0.012184 0.005554 0.003954 -0.366166 0.025836 0.033213 0.017257 0.023412 -0.009427 -0.026380 0.041211 0.037245 0.014357 0.018989 0.016710 0.041277 0.041095 -0.086564
qa: 0.0368 0.7779 -0.3738 -0.2105 -0.3098 -0.1596 -0.2113 -0.0462 -0.0560 -0.0950 0.3483 -0.0948 -0.1355 -0.2422 -0.0772 -0.0732 0.0514 0.1067 0.1086 0.0608 0.0825 0.1961 0.1650 0.1633 0.1651 0.0785 0.0992 0.0866 0.1547 0.1552 0.2486
va: 1.3502 5.7036 2.1196 2.2311 2.2055 3.1325 3.2396 3.8278 3.7599 3.8782 4.3328 4.0084 4.0204 3.9601 3.9666 3.9812 4.1058 1.0013 1.0113 1.0100 1.0145 1.0192 1.0314 1.0050 1.0023 1.0038 1.0059 1.0034 1.0037 1.0041 1.0096
dispcorr: -0.013567697 hartree
energy: -1582.912961500033
dipole: 40.29920 -40.79421 -0.49500 -1.82009 1.03253 -0.78755 -1.14701 2.14699 0.99998
magnitude: 1.36573 au
magnitude: 3.47141 debye
temp: 298.15 k
press: 1.00 atm
zeropoint: 0.24430169 hartree
thermalvibcorrection: 0.01494087 hartree
thermalrotcorrection: 0.00141627 hartree
thermaltrasncorrection: 0.00141627 hartree
thermaltotal: -1582.65088639 hartree
thermalcorr: 0.01777341 hartree
nonthermalcorr: 0.24430169 hartree
totalcorr: 0.26207511 hartree
thermalcorrenthalpy: 0.00094421 hartree
totalenthalpy: -1582.64994218 hartree
totalentropycorr: -0.06332337 hartree
gibbsenthalpy: -1582.71326555 hartree
gibbsminuselec: 0.19969595 hartree
