program: Orca
programVersion: 5.0.2
elementType: Cl S O O O N N C C C C C C C C C C H H H H H H H H H H H H H H
charge: 1
multiplicity: 1
keywords: wB97X-D3 TightOpt Freq def2-TZVPP def2/J RIJCOSX TightSCF defgrid3
frequency: 0.00 0.00 0.00 0.00 0.00 0.00 9.53 26.89 36.42 46.52 70.66 85.93 99.71 108.34 145.73 161.56 194.70 233.22 252.29 280.77 289.31 298.11 334.85 360.27 390.44 411.76 452.88 480.58 495.32 505.52 534.75 560.80 586.88 628.13 639.37 699.44 728.29 755.97 775.16 794.13 850.86 860.98 873.70 907.26 916.39 950.04 982.74 1008.00 1026.56 1038.06 1057.34 1086.46 1113.20 1134.40 1142.08 1150.35 1157.68 1193.44 1224.56 1242.14 1296.99 1327.54 1343.30 1345.13 1352.50 1369.46 1400.51 1425.84 1432.40 1458.43 1492.35 1499.62 1507.21 1515.50 1529.00 1564.60 1636.01 1653.90 1891.96 3057.68 3063.85 3093.41 3102.39 3136.14 3153.12 3154.29 3226.52 3228.46 3243.24 3244.52 3591.98 3640.22 3766.56
frequency: 9.53 26.89 36.42 46.52 70.66 85.93 99.71 108.34 145.73 161.56 194.70 233.22 252.29 280.77 289.31 298.11 334.85 360.27 390.44 411.76 452.88 480.58 495.32 505.52 534.75 560.80 586.88 628.13 639.37 699.44 728.29 755.97 775.16 794.13 850.86 860.98 873.70 907.26 916.39 950.04 982.74 1008.00 1026.56 1038.06 1057.34 1086.46 1113.20 1134.40 1142.08 1150.35 1157.68 1193.44 1224.56 1242.14 1296.99 1327.54 1343.30 1345.13 1352.50 1369.46 1400.51 1425.84 1432.40 1458.43 1492.35 1499.62 1507.21 1515.50 1529.00 1564.60 1636.01 1653.90 1891.96 3057.68 3063.85 3093.41 3102.39 3136.14 3153.12 3154.29 3226.52 3228.46 3243.24 3244.52 3591.98 3640.22 3766.56
formula: C10H14ClN2O3S
InChI: InChI=1S/C10H14ClN2O3S/c1-2-7-12-10(14)13-17(15,16)9-5-3-8(11)4-6-9/h3-6,12-13,15H,2,7H2,1H3
31 atoms
Cl -5.833418 0.265502 -0.814369
S  0.096011 -0.460715 0.673096
O  0.589414 -1.782637 0.550241
O  0.175996 0.054433 2.141162
O  2.670676 1.978436 -0.370244
N  0.897596 0.555633 -0.26745
N  3.081599 -0.197419 0.215302
C  4.539858 -0.065204 0.292562
C  -1.568531 -0.231805 0.310072
C  5.225911 -0.229863 -1.056201
C  2.334445 0.852125 -0.158117
C  -2.159656 -1.184834 -0.51519
C  -2.267552 0.872129 0.798473
C  6.73709 -0.091479 -0.932947
C  -3.486041 -1.026327 -0.860043
C  -3.590302 1.019315 0.444031
C  -4.193132 0.072882 -0.383559
H  4.890247 -0.814904 1.002674
H  4.753395 0.916064 0.714618
H  4.972206 -1.208579 -1.473105
H  4.834887 0.522383 -1.744878
H  0.37549 1.371036 -0.565911
H  2.707482 -1.12084 0.063996
H  -1.597809 -2.038332 -0.870701
H  -1.798382 1.593838 1.453721
H  7.153075 -0.84499 -0.262008
H  7.217195 -0.211829 -1.902665
H  7.013064 0.890867 -0.546827
H  -3.976859 -1.751336 -1.493623
H  -4.164539 1.85894 0.80927
H  1.030756 -0.13482 2.557941
totalener: -1582.89751835 hartree
nucrepener: 1484.05411780 hartree
electener: -3066.95163615 hartree
oneelecener: -5099.19377532 hartree
twoeener: 2032.24213917 hartree
kineticenergy: 1578.48080658 hartree
xcener: -108.599810346552 hartree
chargesum: 1.0000000
charge: 0.036120 0.778207 -0.372470 -0.200378 -0.304943 -0.153505 -0.246883 -0.045415 -0.023446 -0.100526 0.330506 -0.090918 -0.130309 -0.242055 -0.079221 -0.079627 0.053298 0.107916 0.109364 0.062455 0.084109 0.192514 0.177276 0.162243 0.157687 0.079091 0.099994 0.087133 0.154084 0.154010 0.243691
charge: 0.508046 0.857401 -0.172554 0.199581 0.146017 0.125251 0.307691 -0.036306 -0.265004 -0.043429 -0.496576 0.020902 0.005588 0.013069 0.005890 0.005113 -0.365923 0.025327 0.032632 0.017575 0.023675 -0.010009 -0.027936 0.041316 0.037268 0.014651 0.019534 0.016933 0.041303 0.041205 -0.088233
qa: 0.0361 0.7782 -0.3725 -0.2004 -0.3049 -0.1535 -0.2469 -0.0454 -0.0234 -0.1005 0.3305 -0.0909 -0.1303 -0.2421 -0.0792 -0.0796 0.0533 0.1079 0.1094 0.0625 0.0841 0.1925 0.1773 0.1622 0.1577 0.0791 0.1000 0.0871 0.1541 0.1540 0.2437
va: 1.3494 5.6634 2.1148 2.2251 2.2055 3.1187 3.1938 3.8305 3.7280 3.8879 4.3457 3.9992 4.0468 3.9622 3.9718 3.9931 4.1052 1.0008 1.0113 1.0093 1.0136 1.0216 1.0220 1.0037 1.0070 1.0037 1.0059 1.0033 1.0041 1.0044 1.0247
dispcorr: -0.013677848 hartree
energy: -1582.911256440108
dipole: 40.96609 -40.91612 0.04997 -1.35722 0.86678 -0.49044 -1.09901 1.92599 0.82698
magnitude: 0.96277 au
magnitude: 2.44717 debye
temp: 298.15 k
press: 1.00 atm
zeropoint: 0.24407169 hartree
thermalvibcorrection: 0.01506213 hartree
thermalrotcorrection: 0.00141627 hartree
thermaltrasncorrection: 0.00141627 hartree
thermaltotal: -1582.64929008 hartree
thermalcorr: 0.01789467 hartree
nonthermalcorr: 0.24407169 hartree
totalcorr: 0.26196636 hartree
thermalcorrenthalpy: 0.00094421 hartree
totalenthalpy: -1582.64834587 hartree
totalentropycorr: -0.06399595 hartree
gibbsenthalpy: -1582.71234182 hartree
gibbsminuselec: 0.19891462 hartree
