program: Orca
programVersion: 5.0.2
elementType: Cl S N N C C C C C C C C C C C C C C C C C H H H H H H H H H H H H H H H H H H H H
charge: 1
multiplicity: 1
keywords: wB97X-D3 TightOpt Freq def2-TZVPP def2/J RIJCOSX TightSCF defgrid3
frequency: 0.00 0.00 0.00 0.00 0.00 0.00 28.26 40.17 50.01 86.30 90.44 101.52 110.77 131.72 149.80 193.84 233.52 239.75 257.57 273.32 281.70 294.43 314.54 342.99 373.36 378.34 403.58 420.07 423.67 432.11 454.74 471.00 500.25 512.42 560.31 573.30 619.98 645.99 656.63 704.69 722.94 755.77 772.77 783.41 802.49 834.89 872.28 874.22 916.93 922.96 937.89 947.89 985.82 1003.84 1007.86 1016.71 1033.41 1044.14 1058.81 1070.56 1073.86 1091.42 1099.50 1108.13 1127.49 1135.68 1162.49 1176.50 1179.81 1190.35 1203.46 1254.21 1266.86 1270.93 1275.31 1280.36 1298.16 1306.49 1317.17 1344.17 1350.25 1385.62 1405.35 1426.63 1434.24 1445.58 1456.53 1464.27 1473.53 1483.22 1489.46 1496.65 1499.29 1508.61 1510.23 1514.82 1517.78 1521.60 1529.32 1623.05 1655.80 1658.42 1678.15 3005.09 3089.70 3091.51 3097.00 3099.68 3125.25 3135.23 3154.55 3191.41 3195.97 3197.57 3206.29 3208.37 3210.86 3213.49 3223.37 3227.72 3231.60 3234.43 3404.93
frequency: 28.26 40.17 50.01 86.30 90.44 101.52 110.77 131.72 149.80 193.84 233.52 239.75 257.57 273.32 281.70 294.43 314.54 342.99 373.36 378.34 403.58 420.07 423.67 432.11 454.74 471.00 500.25 512.42 560.31 573.30 619.98 645.99 656.63 704.69 722.94 755.77 772.77 783.41 802.49 834.89 872.28 874.22 916.93 922.96 937.89 947.89 985.82 1003.84 1007.86 1016.71 1033.41 1044.14 1058.81 1070.56 1073.86 1091.42 1099.50 1108.13 1127.49 1135.68 1162.49 1176.50 1179.81 1190.35 1203.46 1254.21 1266.86 1270.93 1275.31 1280.36 1298.16 1306.49 1317.17 1344.17 1350.25 1385.62 1405.35 1426.63 1434.24 1445.58 1456.53 1464.27 1473.53 1483.22 1489.46 1496.65 1499.29 1508.61 1510.23 1514.82 1517.78 1521.60 1529.32 1623.05 1655.80 1658.42 1678.15 3005.09 3089.70 3091.51 3097.00 3099.68 3125.25 3135.23 3154.55 3191.41 3195.97 3197.57 3206.29 3208.37 3210.86 3213.49 3223.37 3227.72 3231.60 3234.43 3404.93
formula: C17H20ClN2S
InChI: InChI=1S/C17H20ClN2S/c1-19(2)10-5-11-20-14-6-3-4-7-16(14)21-17-9-8-13(18)12-15(17)20/h3-4,6-9,12,19H,5,10-11H2,1-2H3
41 atoms
Cl 3.370412 -2.483159 -0.935537
S  -1.50229 0.211068 1.921514
N  -0.969742 0.218814 -1.05489
N  2.284028 1.656241 0.266979
C  -0.804801 1.678629 -1.184492
C  0.590826 2.172652 -1.581249
C  1.457101 2.696419 -0.437863
C  -0.0096 -0.469382 -0.26287
C  -2.321115 -0.092343 -0.679624
C  -0.113246 -0.519751 1.132905
C  -2.703982 -0.091721 0.658875
C  1.046287 -1.120621 -0.894371
C  -3.262621 -0.361259 -1.660438
C  0.875529 -1.158977 1.876716
C  -4.022817 -0.341271 1.013358
C  2.636975 2.083363 1.644961
C  3.495295 1.288925 -0.511577
C  2.033143 -1.737309 -0.139815
C  -4.5834 -0.590909 -1.311185
C  1.960738 -1.748041 1.247081
C  -4.962576 -0.575434 0.023403
H  -1.509251 1.980179 -1.957854
H  -1.118062 2.191549 -0.264503
H  0.450973 3.024502 -2.247293
H  1.114763 1.425405 -2.179992
H  0.827184 3.159721 0.320786
H  2.165777 3.446416 -0.788237
H  1.083887 -1.133415 -1.975361
H  -2.945512 -0.381107 -2.695241
H  0.785134 -1.213754 2.954329
H  -4.308455 -0.36038 2.057316
H  3.248359 1.312577 2.106757
H  3.18937 3.019301 1.594482
H  1.720966 2.218863 2.214554
H  3.201778 0.967236 -1.506477
H  4.00688 0.473254 -0.007992
H  4.143589 2.160151 -0.574744
H  -5.316353 -0.791562 -2.081022
H  2.726428 -2.247308 1.825103
H  -5.991455 -0.765204 0.298355
H  1.704701 0.814549 0.34844
totalener: -1627.59206312 hartree
nucrepener: 2042.30752935 hartree
electener: -3669.89959247 hartree
oneelecener: -6266.04175172 hartree
twoeener: 2596.14215925 hartree
kineticenergy: 1622.70922742 hartree
xcener: -117.834296188963 hartree
chargesum: 1.0000000
charge: -0.021581 0.019936 -0.073038 0.147867 -0.114355 -0.144441 -0.137364 0.125086 0.139854 -0.138087 -0.075507 -0.323003 -0.255606 -0.083743 -0.056351 -0.168141 -0.189849 0.118804 -0.047657 -0.149930 -0.139502 0.116153 0.103197 0.125842 0.098610 0.133722 0.134290 0.136534 0.139385 0.140821 0.129968 0.134125 0.138790 0.134397 0.142508 0.134801 0.132856 0.143614 0.146285 0.144248 0.056463
charge: 0.445892 0.704803 0.218101 0.441772 -0.051910 -0.010616 0.010715 -0.179413 -0.161302 -0.328372 -0.303741 -0.029286 0.009104 -0.027706 -0.022258 0.064331 0.063353 -0.417881 0.006418 -0.038490 0.005642 0.033525 0.015076 0.044164 0.027394 0.035277 0.035781 0.034507 0.031147 0.033608 0.027341 0.028445 0.031524 0.028089 0.026856 0.027430 0.029319 0.029345 0.033468 0.030131 0.018418
qa: -0.0216 0.0199 -0.0730 0.1479 -0.1144 -0.1444 -0.1374 0.1251 0.1399 -0.1381 -0.0755 -0.3230 -0.2556 -0.0837 -0.0564 -0.1681 -0.1898 0.1188 -0.0477 -0.1499 -0.1395 0.1162 0.1032 0.1258 0.0986 0.1337 0.1343 0.1365 0.1394 0.1408 0.1300 0.1341 0.1388 0.1344 0.1425 0.1348 0.1329 0.1436 0.1463 0.1442 0.0565
va: 1.2876 2.4829 2.8739 3.5905 3.9257 3.8326 3.8297 3.5416 3.6923 3.9131 3.9662 4.0152 4.1367 3.7640 3.9050 3.8411 3.8830 3.8031 3.9284 3.9324 4.0084 1.0014 0.9984 1.0071 1.0245 0.9996 1.0062 1.0373 1.0151 1.0098 1.0061 0.9989 0.9998 0.9982 0.9952 0.9994 1.0058 0.9969 1.0082 0.9975 1.1863
dispcorr: -0.026261618 hartree
energy: -1627.618416651751
dipole: 4.43187 -2.02006 2.41182 22.65167 -19.91779 2.73388 -1.31431 1.56296 0.24864
magnitude: 3.65415 au
magnitude: 9.28810 debye
temp: 298.15 k
press: 1.00 atm
zeropoint: 0.34617092 hartree
thermalvibcorrection: 0.01621843 hartree
thermalrotcorrection: 0.00141627 hartree
thermaltrasncorrection: 0.00141627 hartree
thermaltotal: -1627.25319476 hartree
thermalcorr: 0.01905097 hartree
nonthermalcorr: 0.34617092 hartree
totalcorr: 0.36522189 hartree
thermalcorrenthalpy: 0.00094421 hartree
totalenthalpy: -1627.25225055 hartree
totalentropycorr: -0.06502285 hartree
gibbsenthalpy: -1627.31727341 hartree
gibbsminuselec: 0.30114325 hartree
