program: Gaussian 09
title: 000005215
version: EM64L-G09RevD.01
frameworkgroup: C1[X(C10H10N4O2S)]
method: RPBEPBE
basis: SDD
operation: Freq
keyword: #p
keyword: freq=noraman
keyword: PBEPBE/SDD
title: #p freq=noraman PBEPBE/SDD
converged: YES YES NO NO
title: Mulliken charges:
elementType: S O O N N N N C C C C C C C C C C H H H H H H H H H H
charge: 0.992225 -0.543131 -0.491974 -0.607752 -0.687814 -0.056864 -0.063566 -0.092410 -0.224441 -0.145066 0.517085 -0.390858 -0.410044 0.132244 -0.260962 -0.249844 -0.172788 0.284424 0.285283 0.364213 0.231521 0.230070 0.315098 0.315107 0.249524 0.243835 0.236886
chargesum: 0.00000
title: Mulliken charges with hydrogens summed into heavy atoms:
elementType: S O O N N N N C C C C C C C C C C
charge: 0.992225 -0.543131 -0.491974 -0.243539 -0.057609 -0.056864 -0.063566 -0.092410 0.059982 0.140217 0.517085 -0.159337 -0.179975 0.132244 -0.011438 -0.006009 0.064097
polarizability: 2.27994654e+02 -4.57836337e+00 1.73675839e+02 -7.10450083e+00 -2.16056139e+01 1.19496470e+02
1716.lowfreq: -11.7205 -10.9531 -0.0017 -0.0009 -0.0005 3.1041 21.4303 41.5920 59.2647
frequency: 20.9383 41.5435 59.2539 74.6249 95.5319 136.0199 158.0993 181.8007 221.9537 236.0319 248.2868 299.9626 324.8819 399.5701 403.5033 409.9874 411.7664 413.3621 429.6546 442.6327 512.4752 519.3224 533.7708 598.6754 611.8391 618.2205 622.2199 702.1438 720.0782 788.8557 801.3910 804.3634 810.0799 817.1303 833.3451 861.2495 945.5370 947.0441 953.9747 956.9504 965.3487 974.1957 980.9346 1023.0358 1050.6099 1054.9156 1075.2229 1133.0904 1174.3894 1185.7824 1265.0939 1300.7048 1303.4312 1322.9639 1360.3853 1400.8852 1406.2034 1435.3095 1443.2857 1489.3034 1518.3835 1551.4048 1586.2786 1613.2395 1649.3331 3135.5654 3137.5660 3138.0595 3140.2619 3165.3227 3181.5249 3189.0595 3512.7141 3562.1929 3701.3133
redmass: 5.2087 4.4818 4.9455 7.1904 6.4841 7.4864 6.3085 6.6391 10.9095 9.1028 9.7532 6.3451 5.8362 4.1639 3.1466 2.9876 1.3997 2.3898 1.8409 3.3291 2.1676 2.6940 1.8127 5.5667 7.4706 5.9334 6.9273 3.0476 2.9092 2.3498 5.1296 2.0717 1.3091 9.1836 1.8250 5.8337 1.4407 6.8825 8.9351 1.3818 1.4097 1.4466 5.0857 1.4393 2.5274 2.5898 1.7308 1.1975 1.5857 1.1175 4.2199 1.4478 1.2964 2.5890 1.8250 5.5748 1.7343 3.7087 5.8279 2.8954 5.6276 5.0148 7.3868 4.8583 1.2210 1.0899 1.0905 1.0896 1.0925 1.0959 1.0951 1.0989 1.0775 1.0453 1.1040
irintensity: 1.3397 0.3714 0.7551 0.3868 1.2148 0.6195 5.4286 0.8667 2.4737 9.9496 2.0919 34.5362 7.5070 5.9744 2.3482 11.9899 6.8569 0.5671 151.0492 390.7325 18.1521 37.2499 46.5697 6.1644 39.0653 27.7492 2.4145 194.4845 11.3012 8.1404 30.8937 48.9109 1.5404 114.4170 83.4184 25.1168 2.8804 29.8634 57.5880 0.2535 1.9782 0.6015 8.3916 1.4451 55.0287 1.7709 10.0945 12.9684 10.2627 47.5462 11.7258 2.4256 5.7669 68.6968 7.1919 2.0643 2.9944 3.5077 671.8472 68.0850 59.3963 253.8021 12.8675 175.2237 260.2041 11.7614 18.6546 13.4100 22.7373 6.8198 5.3856 16.7511 85.6242 111.9376 25.4359
temp: 298.150 k
press: 1.00000 atm
elementType: 16 8 8 7 7 7 7 6 6 6 6 6 6 6 6 6 6 1 1 1 1 1 1 1 1 1 1
symmnumber: 1
zpe: 508983.4 jmol-1
zpe.correction: 0.193862 hartree
zpe.thermalcorrener: 0.209625 hartree
zpe.thermalcorrenthalpy: 0.210570 hartree
zpe.thermalcorrgfe: 0.149341 hartree
zpe.sumelectzpe: -1153.181890 hartree
zpe.sumelectthermal: -1153.166126 hartree
zpe.sumelectthermalent: -1153.165182 hartree
zpe.sumelectthermalfe: -1153.226411 hartree
dipole: 3.5410 -7.5764 -1.9672
dipole: 8.5913
quadrupole: -70.9275 -105.6781 -109.8233
quadrupole: -4.7716 -4.6601 -8.6817
quadrupole: 24.5488 -10.2018 -14.3470 -4.7716 -4.6601 -8.6817
hfenergy: -1153.3757512 hartree
pointgroup: C01[X(C10H10N4O2S1)]
dipole: -1.49697 -3.0244188 -0.192183 debye
polarizability: 227.9259705|-0.6167467|159.4522907|7.8846882|32.4110041|133.7887016 unknown
InChI: InChI=1S/C10H10N4O2S/c11-8-2-4-9(5-3-8)17(15,16)14-10-12-6-1-7-13-10/h1-7,14H,11H2
charge 0 multiplicity 1
27 atoms
S  0.084144 1.826914 0.123265
O  -0.355981 3.009259 1.151155
O  0.75383 2.166096 -1.310401
N  1.301421 0.916786 1.204428
N  -4.66282 -1.829515 -0.64964
N  3.238784 -0.336301 1.561083
N  1.785239 -0.782968 -0.367328
C  -1.344844 0.661276 -0.099828
C  -2.40401 0.744013 0.822579
C  -1.347989 -0.214356 -1.200242
C  -3.56213 -1.002488 -0.466633
C  -3.515878 -0.093718 0.635716
C  -2.464785 -1.045664 -1.382265
C  2.137599 -0.096712 0.769785
C  4.036897 -1.367521 1.170262
C  2.625504 -1.790518 -0.732323
C  3.778096 -2.135079 0.010059
H  -2.362407 1.461496 1.648138
H  -0.492502 -0.241689 -1.880233
H  1.60672 1.492742 1.998515
H  -4.355809 -0.0455 1.337942
H  -2.494018 -1.735981 -2.232935
H  -5.449967 -1.801654 -0.00775
H  -4.70802 -2.472491 -1.435104
H  4.907372 -1.565004 1.805752
H  2.355089 -2.331795 -1.645919
H  4.436965 -2.949328 -0.29908
