program: Orca
programVersion: 5.0.2
elementType: S O O N C C C C C C C C C C C C H H H H H H H H H H H H H H
charge: 1
multiplicity: 1
keywords: wB97X-D3 TightOpt Freq def2-TZVPP def2/J RIJCOSX TightSCF defgrid3
frequency: 0.00 0.00 0.00 0.00 0.00 0.00 15.72 39.55 49.21 96.15 99.32 149.87 159.26 210.97 227.36 249.90 298.14 324.33 382.15 402.64 414.08 418.93 450.24 501.95 536.10 582.48 615.73 629.88 634.76 648.77 709.46 716.99 727.58 754.00 771.94 796.97 866.77 879.82 887.60 919.73 966.69 997.92 1022.33 1029.35 1032.79 1054.08 1055.67 1064.15 1065.28 1101.50 1121.26 1129.29 1192.34 1210.51 1213.85 1249.38 1266.02 1278.25 1317.38 1329.89 1352.87 1361.50 1403.16 1420.36 1442.62 1467.70 1480.51 1493.02 1514.53 1516.87 1548.00 1555.36 1614.41 1677.49 1682.12 1712.84 3073.73 3103.97 3106.09 3155.56 3165.61 3173.26 3193.84 3206.05 3214.81 3222.31 3230.77 3238.14 3650.75 3659.51
frequency: 15.72 39.55 49.21 96.15 99.32 149.87 159.26 210.97 227.36 249.90 298.14 324.33 382.15 402.64 414.08 418.93 450.24 501.95 536.10 582.48 615.73 629.88 634.76 648.77 709.46 716.99 727.58 754.00 771.94 796.97 866.77 879.82 887.60 919.73 966.69 997.92 1022.33 1029.35 1032.79 1054.08 1055.67 1064.15 1065.28 1101.50 1121.26 1129.29 1192.34 1210.51 1213.85 1249.38 1266.02 1278.25 1317.38 1329.89 1352.87 1361.50 1403.16 1420.36 1442.62 1467.70 1480.51 1493.02 1514.53 1516.87 1548.00 1555.36 1614.41 1677.49 1682.12 1712.84 3073.73 3103.97 3106.09 3155.56 3165.61 3173.26 3193.84 3206.05 3214.81 3222.31 3230.77 3238.14 3650.75 3659.51
formula: C12H14NO2S
InChI: InChI=1S/C12H14NO2S/c1-9-11(16-8-7-15-9)12(14)13-10-5-3-2-4-6-10/h2-6,13-14H,7-8H2,1H3
30 atoms
S  2.45294 -1.498985 -0.485479
O  3.238111 1.434428 0.11796
O  -0.324221 -1.608807 0.348934
N  -0.93088 0.421455 -0.320374
C  3.949135 -0.895181 0.302285
C  4.253592 0.484191 -0.235565
C  1.43861 -0.087837 -0.136501
C  1.950408 1.145667 0.150543
C  0.03551 -0.412484 -0.022399
C  1.181095 2.344036 0.615972
C  -2.341739 0.200377 -0.156605
C  -3.165777 0.438859 -1.244398
C  -2.85444 -0.192362 1.06889
C  -4.533491 0.27309 -1.101039
C  -4.222648 -0.363241 1.196796
C  -5.060769 -0.130949 0.116092
H  4.746584 -1.58345 0.028436
H  3.843099 -0.89029 1.386212
H  5.162248 0.889368 0.204688
H  4.355592 0.471348 -1.320261
H  1.815084 2.911521 1.29337
H  0.259171 2.0871 1.129434
H  0.953787 2.997611 -0.229395
H  -0.656507 1.282426 -0.763794
H  -2.744917 0.742174 -2.19515
H  -2.199164 -0.359778 1.913118
H  -5.185597 0.455756 -1.944359
H  -4.634811 -0.67128 2.148201
H  -6.129074 -0.261908 0.224409
H  0.466777 -2.141268 0.540498
totalener: -1068.93628271 hartree
nucrepener: 1195.65246064 hartree
electener: -2264.58874335 hartree
oneelecener: -3817.14970627 hartree
twoeener: 1552.56096292 hartree
kineticenergy: 1065.36688833 hartree
xcener: -84.074143403518 hartree
chargesum: 1.0000000
charge: -0.038756 -0.223810 -0.212651 -0.146059 -0.141798 -0.004188 -0.168659 0.198688 0.464441 -0.266665 0.227634 -0.215861 -0.192981 -0.079014 -0.083092 -0.116223 0.134293 0.123042 0.125712 0.129044 0.125226 0.108419 0.120091 0.192923 0.135301 0.130342 0.149077 0.148382 0.150962 0.226178
charge: 0.662992 0.353668 0.456757 0.407997 -0.216286 -0.079602 -0.365677 -0.208220 -0.253526 0.041335 -0.130947 0.003845 0.003870 0.014849 0.014429 0.018946 0.027294 0.016388 0.033491 0.027326 0.042040 0.023563 0.035026 0.017490 0.028152 0.027530 0.032868 0.032549 0.033000 -0.101146
qa: -0.0388 -0.2238 -0.2127 -0.1461 -0.1418 -0.0042 -0.1687 0.1987 0.4644 -0.2667 0.2276 -0.2159 -0.1930 -0.0790 -0.0831 -0.1162 0.1343 0.1230 0.1257 0.1290 0.1252 0.1084 0.1201 0.1929 0.1353 0.1303 0.1491 0.1484 0.1510 0.2262
va: 2.3491 2.2311 2.3373 3.4321 3.9418 3.8639 3.7801 3.8647 3.8490 3.9216 3.5482 4.1027 4.0763 3.9942 3.9785 3.9853 1.0123 1.0157 0.9950 0.9963 1.0168 1.0083 0.9958 0.9957 1.0112 1.0171 0.9968 0.9975 0.9953 1.0643
dispcorr: -0.011864609 hartree
energy: -1068.948165712142
dipole: 0.03128 1.13507 1.16635 5.89986 -5.39493 0.50493 2.47948 -2.24798 0.23150
magnitude: 1.29186 au
magnitude: 3.28366 debye
temp: 298.15 k
press: 1.00 atm
zeropoint: 0.24719034 hartree
thermalvibcorrection: 0.01171926 hartree
thermalrotcorrection: 0.00141627 hartree
thermaltrasncorrection: 0.00141627 hartree
thermaltotal: -1068.68642357 hartree
thermalcorr: 0.01455181 hartree
nonthermalcorr: 0.24719034 hartree
totalcorr: 0.26174215 hartree
thermalcorrenthalpy: 0.00094421 hartree
totalenthalpy: -1068.68547936 hartree
totalentropycorr: -0.05638584 hartree
gibbsenthalpy: -1068.74186520 hartree
gibbsminuselec: 0.20630051 hartree
