program: Orca
programVersion: 5.0.2
elementType: Cl F F F O O O O O O N N C C C C C C C C C C C C C C C C C C C C H H H H H H H H H H H H H H H H H H H
charge: 1
multiplicity: 1
keywords: wB97X-D3 TightOpt Freq def2-TZVPP def2/J RIJCOSX TightSCF defgrid3
frequency: 0.00 0.00 0.00 0.00 0.00 0.00 13.21 15.15 20.25 29.01 35.14 44.17 55.63 61.03 66.63 88.49 93.36 114.39 119.17 129.58 132.64 138.01 149.69 172.23 182.11 191.67 204.17 212.62 226.91 239.11 242.74 268.35 288.66 308.33 315.13 330.01 339.86 352.17 360.08 365.14 374.83 392.85 417.56 423.00 433.73 440.38 457.88 462.58 479.95 506.76 534.69 544.82 549.80 563.20 581.31 623.84 655.34 684.22 696.73 717.12 723.32 736.82 742.14 744.00 774.64 787.44 793.22 797.04 839.53 856.83 875.94 885.39 892.00 909.70 924.34 948.62 954.88 965.24 974.32 997.48 1006.56 1024.84 1029.77 1038.28 1045.31 1077.59 1095.66 1112.35 1148.20 1157.98 1163.27 1183.55 1191.83 1193.18 1197.24 1209.85 1228.34 1230.63 1247.91 1262.96 1273.92 1297.40 1301.21 1303.52 1321.42 1331.37 1332.27 1356.91 1382.06 1423.06 1423.26 1432.35 1449.04 1453.16 1471.24 1472.16 1484.03 1484.96 1496.78 1501.59 1506.07 1507.87 1518.16 1531.57 1536.01 1570.37 1612.07 1642.89 1687.82 1732.67 1742.18 1752.65 1782.10 1830.98 2364.44 3079.31 3091.62 3105.90 3125.01 3166.07 3167.23 3169.55 3176.18 3183.23 3191.12 3196.01 3198.60 3230.30 3235.44 3247.40 3262.63 3266.96 3287.75
frequency: 13.21 15.15 20.25 29.01 35.14 44.17 55.63 61.03 66.63 88.49 93.36 114.39 119.17 129.58 132.64 138.01 149.69 172.23 182.11 191.67 204.17 212.62 226.91 239.11 242.74 268.35 288.66 308.33 315.13 330.01 339.86 352.17 360.08 365.14 374.83 392.85 417.56 423.00 433.73 440.38 457.88 462.58 479.95 506.76 534.69 544.82 549.80 563.20 581.31 623.84 655.34 684.22 696.73 717.12 723.32 736.82 742.14 744.00 774.64 787.44 793.22 797.04 839.53 856.83 875.94 885.39 892.00 909.70 924.34 948.62 954.88 965.24 974.32 997.48 1006.56 1024.84 1029.77 1038.28 1045.31 1077.59 1095.66 1112.35 1148.20 1157.98 1163.27 1183.55 1191.83 1193.18 1197.24 1209.85 1228.34 1230.63 1247.91 1262.96 1273.92 1297.40 1301.21 1303.52 1321.42 1331.37 1332.27 1356.91 1382.06 1423.06 1423.26 1432.35 1449.04 1453.16 1471.24 1472.16 1484.03 1484.96 1496.78 1501.59 1506.07 1507.87 1518.16 1531.57 1536.01 1570.37 1612.07 1642.89 1687.82 1732.67 1742.18 1752.65 1782.10 1830.98 2364.44 3079.31 3091.62 3105.90 3125.01 3166.07 3167.23 3169.55 3176.18 3183.23 3191.12 3196.01 3198.60 3230.30 3235.44 3247.40 3262.63 3266.96 3287.75
formula: C20H19ClF3N2O6
InChI: InChI=1S/C20H19ClF3N2O6/c1-5-8-31-17(29)19(2,3)32-16(28)12-9-11(6-7-13(12)21)26-15(27)10-14(20(22,23)24)25(4)18(26)30/h5-7,9-10,28H,1,8H2,2-4H3
51 atoms
Cl -2.316298 4.087241 -0.492131
F  6.9138 -1.094675 1.296629
F  5.904895 -2.7621 0.38534
F  6.900572 -1.28457 -0.845608
O  -2.222701 -0.320252 -0.207014
O  -5.119836 -2.329784 -0.438658
O  1.879541 -0.618742 -1.619872
O  3.257857 2.0774 1.780593
O  -5.068112 -0.112511 -0.278604
O  -3.361478 1.534816 0.337042
N  2.578665 0.776301 0.036247
N  3.955945 -0.96699 -0.765576
C  -3.095906 -1.381881 0.331637
C  1.377948 1.541012 -0.078435
C  4.88353 -0.641806 0.19944
C  2.74469 -0.298277 -0.84022
C  -3.119356 -1.295449 1.852711
C  -2.439997 -2.652599 -0.169112
C  -1.032322 1.682084 -0.085744
C  0.148681 0.935303 0.018724
C  3.498071 1.156937 1.040532
C  4.700291 0.351008 1.075801
C  -4.531147 -1.20701 -0.185279
C  1.450115 2.912399 -0.282568
C  -2.283127 0.95643 0.032431
C  -0.948888 3.072965 -0.29167
C  4.128684 -2.074167 -1.714623
C  0.297816 3.667535 -0.386025
C  6.169912 -1.457628 0.261138
C  -6.55542 -2.304985 -0.760628
C  -7.358236 -2.285731 0.495179
C  -8.14754 -1.276218 0.824389
H  -3.719722 -2.11542 2.245233
H  -2.106057 -1.397309 2.238487
H  -3.549384 -0.361352 2.211445
H  -2.985217 -3.520229 0.192951
H  -2.419012 -2.679791 -1.25674
H  -1.418371 -2.698011 0.203355
H  0.088752 -0.130247 0.172475
H  5.434177 0.591925 1.825905
H  2.413558 3.396425 -0.35862
H  3.832826 -3.018793 -1.262543
H  3.494656 -1.874643 -2.570265
H  5.160922 -2.128882 -2.038811
H  0.359724 4.733219 -0.553087
H  -6.691486 -3.221861 -1.328107
H  -6.752484 -1.441916 -1.391919
H  -7.285835 -3.163573 1.128373
H  -8.745556 -1.299431 1.725716
H  -8.233987 -0.396703 0.197049
H  -4.181459 0.919087 0.138351
totalener: -2094.14478036 hartree
nucrepener: 3487.59687813 hartree
electener: -5581.74165849 hartree
oneelecener: -9784.63274112 hartree
twoeener: 4202.89108263 hartree
kineticenergy: 2087.11375069 hartree
xcener: -168.912980848487 hartree
chargesum: 1.0000000
charge: 0.019111 -0.141393 -0.152347 -0.150986 -0.242629 -0.217723 -0.394143 -0.337782 -0.346855 -0.246364 -0.122170 -0.126175 0.150154 0.111175 -0.025337 0.359154 -0.268800 -0.223400 0.035164 -0.049176 0.282779 -0.150118 0.373825 -0.084668 0.456785 -0.008685 -0.198695 -0.083643 0.543978 0.049427 -0.213794 -0.148223 0.130268 0.123338 0.125754 0.113478 0.127940 0.110781 0.117522 0.144539 0.146775 0.128347 0.126475 0.133489 0.137493 0.132960 0.120089 0.134911 0.127928 0.105718 0.263752
charge: 0.492183 0.245943 0.222291 0.221452 0.382770 0.360187 0.104950 0.135654 0.247502 0.442543 0.293455 0.286815 -0.205731 -0.104750 -0.120921 -0.425474 0.049076 0.042854 -0.106954 0.070688 -0.367912 -0.000602 -0.394792 0.075540 -0.296524 -0.353217 0.033673 -0.005355 -0.649047 -0.028162 -0.055123 0.069172 0.040807 0.033615 0.026195 0.032777 0.032273 0.028638 0.035322 0.039392 0.047543 0.017272 0.021977 0.014829 0.037287 0.030868 0.027817 0.020720 0.016357 0.013813 -0.179687
qa: 0.0191 -0.1414 -0.1523 -0.1510 -0.2426 -0.2177 -0.3941 -0.3378 -0.3469 -0.2464 -0.1222 -0.1262 0.1502 0.1112 -0.0253 0.3592 -0.2688 -0.2234 0.0352 -0.0492 0.2828 -0.1501 0.3738 -0.0847 0.4568 -0.0087 -0.1987 -0.0836 0.5440 0.0494 -0.2138 -0.1482 0.1303 0.1233 0.1258 0.1135 0.1279 0.1108 0.1175 0.1445 0.1468 0.1283 0.1265 0.1335 0.1375 0.1330 0.1201 0.1349 0.1279 0.1057 0.2638
va: 1.3436 1.1761 1.1614 1.1611 2.2228 2.2519 2.1134 2.1687 2.1643 2.3167 3.1678 3.3273 3.9417 3.8869 3.9848 4.2476 3.9246 3.9137 3.6358 4.0828 4.2563 3.8369 4.1642 4.0898 4.0567 4.1451 3.8556 3.9903 4.4031 3.8141 3.8365 3.9480 1.0073 1.0028 1.0130 1.0111 1.0104 1.0067 1.0337 1.0212 1.0069 0.9906 1.0111 1.0088 1.0113 0.9952 1.0092 1.0075 1.0057 1.0138 1.0991
dispcorr: -0.027168845 hartree
energy: -2094.172016184983
dipole: -51.87123 47.65214 -4.21909 -19.91437 18.18363 -1.73074 1.32962 -1.44802 -0.11840
magnitude: 4.56182 au
magnitude: 11.59523 debye
temp: 298.15 k
press: 1.00 atm
zeropoint: 0.38068963 hartree
thermalvibcorrection: 0.02750721 hartree
thermalrotcorrection: 0.00141627 hartree
thermaltrasncorrection: 0.00141627 hartree
thermaltotal: -2093.76098680 hartree
thermalcorr: 0.03033976 hartree
nonthermalcorr: 0.38068963 hartree
totalcorr: 0.41102939 hartree
thermalcorrenthalpy: 0.00094421 hartree
totalenthalpy: -2093.76004259 hartree
totalentropycorr: -0.08924471 hartree
gibbsenthalpy: -2093.84928730 hartree
gibbsminuselec: 0.32272889 hartree
